[IPython-user] Twisted 8... (Brian Granger)

Cohen-Tanugi, Johann cohen@slac.stanford....
Wed Apr 2 03:17:38 CDT 2008


hello,
with Twisted 2.5 and a recent build of ipython1 from bzr I noticed that the

    testShutdown ...                                                     [FAIL]

occurs for me when I launch 'trial ipython1' from the source directory, but not if I launch it from somewhere else.

Also, I get the following final outrput :
===============================================================================
[FAIL]: ipython1.daemon.tests.test_daemonservice.BasicDaemonServiceTest.testShutdown

Traceback (most recent call last):
  File "/home/cohen/data1/sources/python/ipython1-dev/ipython1/daemon/tests/daemonservicetest.py", line 172, in <lambda>
    d.addCallback(lambda r: self.assertEquals(len(r), len(validCommands)))
twisted.trial.unittest.FailTest: 1 != 3
===============================================================================
[ERROR]: ipython1.daemon.tests.test_daemonservice.BasicDaemonServiceTest.testSignal_33

Traceback (most recent call last):
  File "/home/cohen/data1/sources/python/ipython1-dev/ipython1/daemon/tests/daemonservicetest.py", line 132, in <lambda>
    d.addCallback(lambda r: (r[0],time.sleep(0.1)))
exceptions.KeyboardInterrupt:
-------------------------------------------------------------------------------
Ran 38 tests in 6.862s

FAILED (failures=1, errors=1, successes=36)

I also see other transient errors, but no need to get there on this thread....
HTH,
Johann


-------------- next part --------------
A non-text attachment was scrubbed...
Name: not available
Type: application/ms-tnef
Size: 3081 bytes
Desc: not available
Url : http://lists.ipython.scipy.org/pipermail/ipython-user/attachments/20080402/ce513016/attachment.bin 


More information about the IPython-user mailing list