[Numpy-discussion] test_multiarray.test_clip fails on Solaris 8 system

Christopher Hanley chanley@stsci....
Sun Apr 1 12:58:41 CDT 2007


The following test fails on a Solaris 8 system:

======================================================================
FAIL: check_basic (numpy.core.tests.test_multiarray.test_clip)
----------------------------------------------------------------------
Traceback (most recent call last):
  File "/data/basil5/site-packages/lib/python/numpy/core/tests/test_multiarray.py", line 388, in check_basic
    self._clip_type('float',1024,-12.8,100.2, inplace=inplace)
  File "/data/basil5/site-packages/lib/python/numpy/core/tests/test_multiarray.py", line 382, in _clip_type
    assert_equal(byteorder,x.dtype.byteorder)
  File "/data/basil5/site-packages/lib/python/numpy/testing/utils.py", line 143, in assert_equal
    assert desired == actual, msg
AssertionError: 
Items are not equal:
 ACTUAL: '<'
 DESIRED: '='

----------------------------------------------------------------------
Ran 562 tests in 19.376s

FAILED (failures=1)




More information about the Numpy-discussion mailing list