[Numpy-discussion] NumPy 1.2.0b2 released

Alan G Isaac aisaac@american....
Thu Aug 14 15:58:49 CDT 2008


Two odd failures in test_print.py.
Platform: Win XP SP3 on Intel T2600.
Alan Isaac

 >>> np.test()
Running unit tests for numpy
NumPy version 1.2.0b2
NumPy is installed in C:\Python25\lib\site-packages\numpy
Python version 2.5.2 (r252:60911, Feb 21 2008, 13:11:45) [MSC v.1310 32 
bit (Intel)]
nose version 0.11.0
..........................................................................................
..........................................................................................
..............................................................FF..........................
..........................................................................................
...........................................................................S..............
..................................................................Ignoring 
"Python was bui
lt with Visual Studio 2003;
extensions must be built with a compiler than can generate compatible 
binaries.
Visual Studio 2003 was not found on this system. If you have Cygwin 
installed,
you can try compiling with MingW32, by passing "-c mingw32" to 
setup.py." (one should fix
me in fcompiler/compaq.py)
..........................................................................................
..........................................................................................
..........................................................................................
..........................................................................................
..........................................................................................
..........................................................................................
..........................................................................................
..........................................................................................
..........................................................................................
..........................................................................................
..........................................................................................
.............................................................
======================================================================
FAIL: Check formatting.
----------------------------------------------------------------------
Traceback (most recent call last):
   File "C:\Python25\Lib\site-packages\numpy\core\tests\test_print.py", 
line 28, in test_complex_types
     assert_equal(str(t(x)), str(complex(x)))
   File "C:\Python25\Lib\site-packages\numpy\testing\utils.py", line 
180, in assert_equal
     assert desired == actual, msg
AssertionError:
Items are not equal:
  ACTUAL: '(0+5.9287877500949585e-323j)'
  DESIRED: '(1+0j)'

======================================================================
FAIL: Check formatting.
----------------------------------------------------------------------
Traceback (most recent call last):
   File "C:\Python25\Lib\site-packages\numpy\core\tests\test_print.py", 
line 16, in test_fl
oat_types
     assert_equal(str(t(x)), str(float(x)))
   File "C:\Python25\Lib\site-packages\numpy\testing\utils.py", line 
180, in assert_equal
     assert desired == actual, msg
AssertionError:
Items are not equal:
  ACTUAL: '0.0'
  DESIRED: '1.0'

----------------------------------------------------------------------
Ran 1567 tests in 8.234s

FAILED (SKIP=1, failures=2)
<nose.result.TextTestResult run=1567 errors=0 failures=2>
 >>>





More information about the Numpy-discussion mailing list