[Numpy-discussion] FAIL: Tests mask_rowcols

Nils Wagner nwagner@iam.uni-stuttgart...
Sat Jun 7 02:40:19 CDT 2008


Hi all,

I found one failure in numpy.test() with numpy 
1.2.0.dev5257

======================================================================
FAIL: Tests mask_rowcols.
----------------------------------------------------------------------
Traceback (most recent call last):
   File 
"/usr/local/lib64/python2.5/site-packages/numpy/ma/tests/test_extras.py", 
line 211, in check_mask_rowcols
     assert(mask_rowcols(x).all())
AssertionError

----------------------------------------------------------------------
Ran 1298 tests in 1.845s

FAILED (failures=1)
<unittest._TextTestResult run=1298 errors=0 failures=1>
>>> numpy.__version__
'1.2.0.dev5257'

  
Nils


More information about the Numpy-discussion mailing list