[Numpy-discussion] 1.1.0rc1 OSX Installer - please test

Thomas Hrabe thrabe@burnham....
Wed May 21 18:39:32 CDT 2008


iBook G4 osX 10.5.2

hope this helps!

Numpy is installed in /Library/Frameworks/Python.framework/Versions/2.5/lib/python2.5/site-packages/numpy
Numpy version 1.1.0rc1
Python version 2.5.2 (r252:60911, Feb 22 2008, 07:57:53) [GCC 4.0.1 (Apple Computer, Inc. build 5363)]
  Found 18/18 tests for numpy.core.defmatrix
  Found 3/3 tests for numpy.core.memmap
  Found 283/283 tests for numpy.core.multiarray
  Found 70/70 tests for numpy.core.numeric
  Found 36/36 tests for numpy.core.numerictypes
  Found 12/12 tests for numpy.core.records
  Found 7/7 tests for numpy.core.scalarmath
  Found 16/16 tests for numpy.core.umath
  Found 5/5 tests for numpy.ctypeslib
  Found 5/5 tests for numpy.distutils.misc_util
  Found 2/2 tests for numpy.fft.fftpack
  Found 3/3 tests for numpy.fft.helper
  Found 24/24 tests for numpy.lib._datasource
  Found 10/10 tests for numpy.lib.arraysetops
  Found 1/1 tests for numpy.lib.financial
  Found 0/0 tests for numpy.lib.format
  Found 53/53 tests for numpy.lib.function_base
  Found 5/5 tests for numpy.lib.getlimits
  Found 6/6 tests for numpy.lib.index_tricks
  Found 15/15 tests for numpy.lib.io
  Found 1/1 tests for numpy.lib.machar
  Found 4/4 tests for numpy.lib.polynomial
  Found 49/49 tests for numpy.lib.shape_base
  Found 15/15 tests for numpy.lib.twodim_base
  Found 43/43 tests for numpy.lib.type_check
  Found 1/1 tests for numpy.lib.ufunclike
  Found 89/89 tests for numpy.linalg
  Found 94/94 tests for numpy.ma.core
  Found 15/15 tests for numpy.ma.extras
  Found 7/7 tests for numpy.random
  Found 16/16 tests for numpy.testing.utils
  Found 0/0 tests for __main__
.............................................................................................................................................................................................................................................................................................................FF.............................................................................................................................................................................................................................................................................................................................................................................................................................................................................................................................................................................................................................................................................................................................
======================================================================
FAIL: test_basic (numpy.core.tests.test_multiarray.TestView)
----------------------------------------------------------------------
Traceback (most recent call last):
  File "/Library/Frameworks/Python.framework/Versions/2.5/lib/python2.5/site-packages/numpy/core/tests/test_multiarray.py", line 843, in test_basic
    assert_array_equal(y, [67305985, 134678021])
  File "/Library/Frameworks/Python.framework/Versions/2.5/lib/python2.5/site-packages/numpy/testing/utils.py", line 248, in assert_array_equal
    verbose=verbose, header='Arrays are not equal')
  File "/Library/Frameworks/Python.framework/Versions/2.5/lib/python2.5/site-packages/numpy/testing/utils.py", line 240, in assert_array_compare
    assert cond, msg
AssertionError: 
Arrays are not equal

(mismatch 100.0%)
 x: array([16909060, 84281096])
 y: array([ 67305985, 134678021])

======================================================================
FAIL: test_keywords (numpy.core.tests.test_multiarray.TestView)
----------------------------------------------------------------------
Traceback (most recent call last):
  File "/Library/Frameworks/Python.framework/Versions/2.5/lib/python2.5/site-packages/numpy/core/tests/test_multiarray.py", line 852, in test_keywords
    assert_array_equal(y,[[513]])
  File "/Library/Frameworks/Python.framework/Versions/2.5/lib/python2.5/site-packages/numpy/testing/utils.py", line 248, in assert_array_equal
    verbose=verbose, header='Arrays are not equal')
  File "/Library/Frameworks/Python.framework/Versions/2.5/lib/python2.5/site-packages/numpy/testing/utils.py", line 240, in assert_array_compare
    assert cond, msg
AssertionError: 
Arrays are not equal

(mismatch 100.0%)
 x: array([[258]], dtype=int16)
 y: array([[513]])

----------------------------------------------------------------------
Ran 1004 tests in 6.159s

FAILED (failures=2)
<unittest._TextTestResult run=1004 errors=0 failures=2>
>>>
-------------- next part --------------
A non-text attachment was scrubbed...
Name: not available
Type: application/ms-tnef
Size: 4148 bytes
Desc: not available
Url : http://projects.scipy.org/pipermail/numpy-discussion/attachments/20080521/ea48f2d0/attachment.bin 


More information about the Numpy-discussion mailing list