[Numpy-discussion] Numpy 1.4.0 rc1 released

Bruce Southey bsouthey@gmail....
Tue Dec 1 21:17:30 CST 2009


On Mon, Nov 30, 2009 at 9:47 PM, David Cournapeau <cournape@gmail.com> wrote:
> Hi,
>
> The first release candidate for 1.4.0 has been released. The sources,
> as well as mac and windows installers may be found here:
>
> https://sourceforge.net/projects/numpy/files/
>

I installed 32-bit Python 2.6.3 and 23-bit Python numpy on a Win7 Pro
64-bit system. I get the following  failure:


Python 2.6.3 (r263rc1:75186, Oct  2 2009, 20:40:30) [MSC v.1500 32 bit
(Intel)] on win32
Type "copyright", "credits" or "license()" for more information.

    ****************************************************************
    Personal firewall software may warn about the connection IDLE
    makes to its subprocess using this computer's internal loopback
    interface.  This connection is not visible on any external
    interface and no data is sent to or received from the Internet.
    ****************************************************************

IDLE 2.6.3
>>> import numpy as np
>>> np.__version__
'1.4.0rc1'
>>> np.test()
Running unit tests for numpy
NumPy version 1.4.0rc1
NumPy is installed in E:\Python26\lib\site-packages\numpy
Python version 2.6.3 (r263rc1:75186, Oct  2 2009, 20:40:30) [MSC
v.1500 32 bit (Intel)]
nose version 0.11.1
........................................................................................................................................................................................................................................................................................................................................................................................................................................................................................................................................................................................................................................................................................K.......................................................K..K.............................K......................K.F..........................................................................................................................................................................................................................................................................................................................................................................................................................................................................................................................K........K..................................................................................................................................................................................................................................................................................................................................................................................................................................................S..............................................................................................................................................................................................................................................................................................................................................................................................................................................................................................................................................................................................................................
======================================================================
FAIL: test_special_values (test_umath_complex.TestClog)
----------------------------------------------------------------------
Traceback (most recent call last):
  File "E:\Python26\lib\site-packages\numpy\core\tests\test_umath_complex.py",
line 179, in test_special_values
    assert_almost_equal(np.log(x), y)
  File "E:\Python26\lib\site-packages\numpy\testing\utils.py", line
437, in assert_almost_equal
    "DESIRED: %s\n" % (str(actual), str(desired)))
AssertionError: Items are not equal:
ACTUAL: [ NaN+2.35619449j]
DESIRED: (inf+2.35619449019j)

Bruce

----------------------------------------------------------------------
Ran 2336 tests in 23.571s

FAILED (KNOWNFAIL=7, SKIP=1, failures=1)
>>>


More information about the NumPy-Discussion mailing list