<div dir="ltr"><div>I&#39;m getting a failure and two errors with the latest master branch:<br><br>$ python -c &quot;import numpy; numpy.test(&#39;full&#39;)&quot;<br>Running unit tests for numpy<br>NumPy version 1.8.0.dev-dff8c94<br>
NumPy is installed in /home/warren/local_numpy/lib/python2.7/site-packages/numpy<br>Python version 2.7.4 |Anaconda 1.5.0 (64-bit)| (default, Apr 21 2013, 17:43:08) [GCC 4.1.2 20080704 (Red Hat 4.1.2-52)]<br>nose version 1.3.0<br>
.....................F...................................................................................................................................................................................................................................................................................................................S...............................................................................................................................S..........................................................................................................................................................................................................................................................................................................................................................................................................................................................................................................................................................................................................................................................................................................................................................................................................................................................................................................................................................................................................................................................................................................................................................................................................................................................................................................................................................................K........................................E.E.................................................................................................................................................SSS...............................................................................................................................................................................................................................................................................................................................................K........................................................................................................K......................K...................................................................................................................................................................................................................................................................................................................................................................................................................................................................................................................................................................................................................................................................................................................................................................................................................................................................................................................................................................................................................................................................................................................................................................................................................................................................................................................................................................................................................................................................SS..SS.....................................................................................................SSSSSSSS................................................................................................................................................................................................................................................................................................................................................................................................................................................................................................................................................................................................................................................................................................................................................................................................................................................................................................................................................................................................................................................................................................................................................................................K....................................................<br>
======================================================================<br>ERROR: test_numeric.TestIsclose.test_ip_isclose_allclose([1e-08, 1, 1000020.0000000099], [0, nan, 1000000.0])<br>----------------------------------------------------------------------<br>
Traceback (most recent call last):<br>  File &quot;/home/warren/anaconda/lib/python2.7/site-packages/nose/case.py&quot;, line 197, in runTest<br>    self.test(*self.arg)<br>  File &quot;/home/warren/local_numpy/lib/python2.7/site-packages/numpy/core/tests/test_numeric.py&quot;, line 1253, in tst_isclose_allclose<br>
    assert_array_equal(isclose(x, y).all(), allclose(x, y), msg % (x, y))<br>  File &quot;/home/warren/local_numpy/lib/python2.7/site-packages/numpy/core/numeric.py&quot;, line 2008, in allclose<br>    return all(less_equal(abs(x-y), atol + rtol * abs(y)))<br>
RuntimeWarning: invalid value encountered in absolute<br><br>======================================================================<br>ERROR: test_numeric.TestIsclose.test_ip_isclose_allclose(nan, [nan, nan, nan])<br>----------------------------------------------------------------------<br>
Traceback (most recent call last):<br>  File &quot;/home/warren/anaconda/lib/python2.7/site-packages/nose/case.py&quot;, line 197, in runTest<br>    self.test(*self.arg)<br>  File &quot;/home/warren/local_numpy/lib/python2.7/site-packages/numpy/core/tests/test_numeric.py&quot;, line 1253, in tst_isclose_allclose<br>
    assert_array_equal(isclose(x, y).all(), allclose(x, y), msg % (x, y))<br>  File &quot;/home/warren/local_numpy/lib/python2.7/site-packages/numpy/core/numeric.py&quot;, line 2008, in allclose<br>    return all(less_equal(abs(x-y), atol + rtol * abs(y)))<br>
RuntimeWarning: invalid value encountered in absolute<br><br>======================================================================<br>FAIL: Test numpy dot with different order C, F<br>----------------------------------------------------------------------<br>
Traceback (most recent call last):<br>  File &quot;/home/warren/anaconda/lib/python2.7/site-packages/nose/case.py&quot;, line 197, in runTest<br>    self.test(*self.arg)<br>  File &quot;/home/warren/local_numpy/lib/python2.7/site-packages/numpy/core/tests/test_blasdot.py&quot;, line 114, in test_dot_array_order<br>
    assert_almost_equal(a.dot(a), a.T.dot(a.T).T, decimal=30)<br>  File &quot;/home/warren/local_numpy/lib/python2.7/site-packages/numpy/testing/utils.py&quot;, line 458, in assert_almost_equal<br>    return assert_array_almost_equal(actual, desired, decimal, err_msg)<br>
  File &quot;/home/warren/local_numpy/lib/python2.7/site-packages/numpy/testing/utils.py&quot;, line 819, in assert_array_almost_equal<br>    header=(&#39;Arrays are not almost equal to %d decimals&#39; % decimal))<br>  File &quot;/home/warren/local_numpy/lib/python2.7/site-packages/numpy/testing/utils.py&quot;, line 652, in assert_array_compare<br>
    raise AssertionError(msg)<br>AssertionError: <br>Arrays are not almost equal to 30 decimals<br><br>(mismatch 26.0%)<br> x: array([[ 0.60970873,  1.6909554 , -1.08851945, -1.82058012, -3.95746613,<br>         1.52435613, -0.59853059, -3.72278619,  3.82375932,  5.51367044],<br>
       [-3.58154893, -2.06231236, -0.0656727 ,  1.4737345 ,  2.6068747 ,...<br> y: array([[ 0.60970873,  1.6909554 , -1.08851945, -1.82058001, -3.95746613,<br>         1.52435613, -0.59853059, -3.72278643,  3.82375932,  5.51367044],<br>
       [-3.58154917, -2.06231236, -0.0656727 ,  1.4737345 ,  2.6068747 ,...<br><br>----------------------------------------------------------------------<br>Ran 5151 tests in 60.506s<br><br>FAILED (KNOWNFAIL=5, SKIP=17, errors=2, failures=1)<br>
<br><br><br></div>Warren<br><br></div>