[Numpy-tickets] [NumPy] #735: FAIL: test_record (numpy.lib.tests.test_io.Testloadtxt) -- On Solaris 10

NumPy numpy-tickets@scipy....
Fri Apr 11 21:55:08 CDT 2008


#735: FAIL: test_record (numpy.lib.tests.test_io.Testloadtxt) -- On Solaris 10
------------------------+---------------------------------------------------
 Reporter:  chanley     |       Owner:  somebody
     Type:  defect      |      Status:  new     
 Priority:  normal      |   Milestone:  1.0.5   
Component:  numpy.core  |     Version:  none    
 Severity:  normal      |    Keywords:  Solaris 
------------------------+---------------------------------------------------
 The following test case fails on Solaris 10 with 1.0.5.dev5024

 {{{
 ======================================================================
 FAIL: test_record (numpy.lib.tests.test_io.Testloadtxt)
 ----------------------------------------------------------------------
 Traceback (most recent call last):
   File "/data/basil5/site-packages/lib/python/numpy/lib/tests/test_io.py",
 line
 42, in test_record
     assert_array_equal(x, a)
   File "numpy/testing/utils.py", line 248, in assert_array_equal
   File "numpy/testing/utils.py", line 240, in assert_array_compare
 AssertionError:
 Arrays are not equal

 (mismatch 100.0%)
  x: array([(1, 2), (3, 4)],
       dtype=[('x', '>i4'), ('y', '>i4')])
  y: array([(1, 2), (3, 4)],
       dtype=[('x', '<i4'), ('y', '<i4')])

 ----------------------------------------------------------------------
 Ran 895 tests in 9.468s

 FAILED (failures=1)
 <unittest._TextTestResult run=895 errors=0 failures=1>
 >>> numpy.__version__
 '1.0.5.dev5024'
 }}}

-- 
Ticket URL: <http://scipy.org/scipy/numpy/ticket/735>
NumPy <http://projects.scipy.org/scipy/numpy>
The fundamental package needed for scientific computing with Python.


More information about the Numpy-tickets mailing list