[Numpy-tickets] [NumPy] #977: Numpy test failure with Python 2.5.3 (win32)

NumPy numpy-tickets@scipy....
Fri Dec 26 12:46:49 CST 2008


#977: Numpy test failure with Python 2.5.3 (win32)
---------------------+------------------------------------------------------
 Reporter:  raybaut  |       Owner:  somebody
     Type:  defect   |      Status:  new     
 Priority:  normal   |   Milestone:  1.3.0   
Component:  Other    |     Version:  none    
 Severity:  normal   |    Keywords:          
---------------------+------------------------------------------------------
 Running unit tests for numpy
 NumPy version 1.2.1
 NumPy is installed in C:\Program Files\pythonxy\python\lib\site-
 packages\numpy
 Python version 2.5.3 (r253:67855, Dec 19 2008, 16:58:30) [MSC v.1310 32
 bit (Intel)]
 nose version 0.10.4
 ======================================================================
 FAIL: test_umath.TestComplexFunctions.test_against_cmath
 ----------------------------------------------------------------------
 Traceback (most recent call last):
   File "nose\case.py", line 182, in runTest
     self.test(*self.arg)
   File "C:\Program Files\pythonxy\python\lib\site-
 packages\numpy\core\tests\test_umath.py", line 268
 , in test_against_cmath
     assert abs(a - b) < atol, "%s %s: %s; cmath: %s"%(fname,p,a,b)
 AssertionError: arcsinh -2j: (-1.31695789692-1.57079632679j); cmath:
 (1.31695789692-1.57079632679j)

 ----------------------------------------------------------------------
 Ran 1592 tests in 11.484s

 FAILED (KNOWNFAIL=3, failures=1)
 Out[1]: <nose.result.TextTestResult run=1592 errors=0 failures=1>

-- 
Ticket URL: <http://scipy.org/scipy/numpy/ticket/977>
NumPy <http://projects.scipy.org/scipy/numpy>
The fundamental package needed for scientific computing with Python.


More information about the Numpy-tickets mailing list