[Numpy-tickets] [NumPy] #898: NumPy trunk doesn't compile on Windows

NumPy numpy-tickets@scipy....
Wed Sep 10 02:39:48 CDT 2008


#898: NumPy trunk doesn't compile on Windows
-----------------------------+----------------------------------------------
 Reporter:  albertstrasheim  |        Owner:  cdavid     
     Type:  defect           |       Status:  new        
 Priority:  highest          |    Milestone:  Unscheduled
Component:  numpy.core       |      Version:  devel      
 Severity:  blocker          |   Resolution:             
 Keywords:                   |  
-----------------------------+----------------------------------------------
Comment (by albertstrasheim):

 Test failures with Python 2.6b2 and !NumPy 1.3.0.dev5800:

 {{{
 ======================================================================
 FAIL: Check formatting.
 ----------------------------------------------------------------------
 Traceback (most recent call last):
   File "C:\Python26\Lib\site-packages\numpy\core\tests\test_print.py",
 line 28, in test_complex_types
     assert_equal(str(t(x)), str(complex(x)))
   File "C:\Python26\Lib\site-packages\numpy\testing\utils.py", line 183,
 in assert_equal
     raise AssertionError(msg)
 AssertionError:
 Items are not equal:
  ACTUAL: '(1e+020+0j)'
  DESIRED: '(1e+20+0j)'

 ======================================================================
 FAIL: Check formatting.
 ----------------------------------------------------------------------
 Traceback (most recent call last):
   File "C:\Python26\Lib\site-packages\numpy\core\tests\test_print.py",
 line 16, in test_float_types
     assert_equal(str(t(x)), str(float(x)))
   File "C:\Python26\Lib\site-packages\numpy\testing\utils.py", line 183,
 in assert_equal
     raise AssertionError(msg)
 AssertionError:
 Items are not equal:
  ACTUAL: '1e+020'
  DESIRED: '1e+20'

 ======================================================================
 FAIL: test_umath.TestComplexFunctions.test_against_cmath
 ----------------------------------------------------------------------
 Traceback (most recent call last):
   File "C:\Python26\Lib\site-packages\nose\case.py", line 182, in runTest
     self.test(*self.arg)
   File "C:\Python26\Lib\site-packages\numpy\core\tests\test_umath.py",
 line 266, in test_against_cmath
     assert abs(a - b) < atol, "%s %s: %s; cmath: %s"%(fname,p,a,b)
 AssertionError: arcsin 2: (1.57079632679-1.31695789692j); cmath:
 (1.57079632679+1.31695789692j)

 ======================================================================
 FAIL: Test _check_fill_value
 ----------------------------------------------------------------------
 Traceback (most recent call last):
   File "C:\Python26\Lib\site-packages\numpy\ma\tests\test_core.py", line
 914, in test_check_on_scalar
     assert_equal(fval, default_fill_value(0))
   File "C:\Python26\Lib\site-packages\numpy\ma\testutils.py", line 97, in
 assert_equal
     assert desired == actual, msg
 AssertionError:
 Items are not equal:
  ACTUAL: 72548393
  DESIRED: 999999

 ----------------------------------------------------------------------
 Ran 1577 tests in 5.781s

 FAILED (KNOWNFAIL=1, failures=4)
 <nose.result.TextTestResult run=1577 errors=0 failures=4>
 }}}

-- 
Ticket URL: <http://scipy.org/scipy/numpy/ticket/898#comment:10>
NumPy <http://projects.scipy.org/scipy/numpy>
The fundamental package needed for scientific computing with Python.


More information about the Numpy-tickets mailing list