[SciPy-dev] FAIL: check_normal (scipy.stats.morestats.test_morestats.test_anderson)

Nils Wagner nwagner at mecha.uni-stuttgart.de
Tue Dec 16 08:40:52 CST 2003


======================================================================
FAIL: check_normal (scipy.stats.morestats.test_morestats.test_anderson)
----------------------------------------------------------------------
Traceback (most recent call last):
  File
"/usr/lib/python2.3/site-packages/scipy/stats/tests/test_morestats.py",
line 49, in check_normal
    assert(scipy.all(A < crit[-2:]))
AssertionError

----------------------------------------------------------------------
Ran 1028 tests in 3.709s

FAILED (failures=1)
<unittest.TextTestRunner object at 0x43954e0c>
>>> scipy.__version__
'0.2.1_251.4492'
>>>



More information about the Scipy-dev mailing list