[SciPy-dev] FAILED(failures=3)inscipy.test()

Nils Wagner wagner.nils at vdi.de
Thu Nov 20 03:22:57 CST 2003


Hi all, 
 
Thanks for the latest bugfixes.  
Now, scipy.test() results in 3 failures. 
 
Is it possible to fix these failures as well ? 
 
====================================================================== 
FAIL: check_random_complex 
(scipy.linalg.decomp.test_decomp.test_cholesky) 
---------------------------------------------------------------------- 
Traceback (most recent call last): 
  File "/usr/lib/python2.3/site-packages/scipy/linalg/tests/
test_decomp.py", line 276, in check_random_complex 
    assert_array_almost_equal(cholesky(a),c) 
  File "/usr/lib/python2.3/site-packages/scipy_test/testing.py", line 592, in 
assert_array_almost_equal 
    assert alltrue(ravel(reduced)),\ 
AssertionError: 
Arrays are not almost equal: 
 
 
====================================================================== 
FAIL: check_simple_complex 
(scipy.linalg.decomp.test_decomp.test_cholesky) 
---------------------------------------------------------------------- 
Traceback (most recent call last): 
  File "/usr/lib/python2.3/site-packages/scipy/linalg/tests/
test_decomp.py", line 250, in check_simple_complex 
    assert_array_almost_equal(cholesky(a),c) 
  File "/usr/lib/python2.3/site-packages/scipy_test/testing.py", line 592, in 
assert_array_almost_equal 
    assert alltrue(ravel(reduced)),\ 
AssertionError: 
Arrays are not almost equal: 
 
 
====================================================================== 
FAIL: check_cdf (scipy.stats.distributions.test_distributions.test_arcsine) 
---------------------------------------------------------------------- 
Traceback (most recent call last): 
  File "<string>", line 10, in check_cdf 
AssertionError: D = 0.299163544178; pval = 0.00353653914938; alpha 
= 0.01 
args = () 
 
 
 


More information about the Scipy-dev mailing list