[SciPy-dev] FAILED (failures=2) in scipy.test() with Python2.2

Nils Wagner nwagner at mecha.uni-stuttgart.de
Thu Nov 20 08:11:52 CST 2003


Dear experts,

scipy.test() with Python2.2 results in

>>> scipy.__version__
'0.2.1_249.4443'
>>> Numeric.__version__
'23.1'
>>>

======================================================================
FAIL: check_pro_ang1_cv (scipy.special.basic.test_basic.test_cephes)
----------------------------------------------------------------------
Traceback (most recent call last):
  File
"/usr/lib/python2.2/site-packages/scipy/special/tests/test_basic.py",
line 384, in check_pro_ang1_cv
    assert_equal(cephes.pro_ang1_cv(1,1,1,1,0),(1.0,0.0))
  File "/usr/lib/python2.2/site-packages/scipy_test/testing.py", line
519, in assert_equal
    assert desired == actual, msg
AssertionError:
Items are not equal:
DESIRED: (1.0, 0.0)
ACTUAL: (0.99999999999999989, 0.0)

======================================================================
FAIL: check_pro_ang1_cv (scipy.special.cephes.test_cephes.test_cephes)
----------------------------------------------------------------------
Traceback (most recent call last):
  File
"/usr/lib/python2.2/site-packages/scipy/special/tests/test_cephes.py",
line 355, in check_pro_ang1_cv
    assert_equal(cephes.pro_ang1_cv(1,1,1,1,0),(1.0,0.0))
  File "/usr/lib/python2.2/site-packages/scipy_test/testing.py", line
519, in assert_equal
    assert desired == actual, msg
AssertionError:
Items are not equal:
DESIRED: (1.0, 0.0)
ACTUAL: (0.99999999999999989, 0.0)

----------------------------------------------------------------------
Ran 1195 tests in 3.637s

FAILED (failures=2)
<unittest.TextTestRunner instance at 0x88fb05c>
>>>

Nils


More information about the Scipy-dev mailing list