[SciPy-dev] ATLAS version and failures inscipy.test()

Nils Wagner wagner.nils at vdi.de
Wed Nov 26 10:34:43 CST 2003


Pearu, 
 
I switched back to ATLAS3.4.1  
http://www.cs.utk.edu/~rwhaley/ATLAS/errata3.4.1.html#rLLt 
Now, scipy.test() gives 
 
====================================================================== 
FAIL: check_normal 
(scipy.stats.morestats.test_morestats.test_anderson) 
---------------------------------------------------------------------- 
Traceback (most recent call last): 
  File "/usr/local/lib/python2.3/site-packages/scipy/stats/tests/
test_morestats.py", line 49, in check_normal 
    assert(scipy.all(A < crit[-2:])) 
AssertionError 
 
---------------------------------------------------------------------- 
Ran 1028 tests in 2.348s 
 
FAILED (failures=1) 
 
Nils 
 


More information about the Scipy-dev mailing list