[SciPy-dev] Results of scipy.test(1, 10) with latest svn versions of newcore and newscipy

Pearu Peterson pearu at scipy.org
Thu Oct 27 04:12:30 CDT 2005



On Thu, 27 Oct 2005, Nils Wagner wrote:

> Ran 1106 tests in 4.692s
>
> FAILED (failures=20, errors=75)

... is now

FAILED (failures=14)

on a 32-bit (mostly special failures, 1 from stats) and

FAILED (failures=26, errors=2)

on a 64-bit machine (sparse, special, linalg failures, 1 from stats).

Pearu




More information about the Scipy-dev mailing list