[SciPy-dev] FAIL: check_nils (scipy.linalg.matfuncs.test_matfuncs.test_signm)

Nils Wagner nwagner at mecha.uni-stuttgart.de
Tue Jan 17 02:22:42 CST 2006


scipy.test(1,10) gives

======================================================================
FAIL: check_nils (scipy.linalg.matfuncs.test_matfuncs.test_signm)
----------------------------------------------------------------------
Traceback (most recent call last):
  File
"/usr/local/lib/python2.4/site-packages/scipy/linalg/tests/test_matfuncs.py",
line 42, in check_nils
    assert_array_almost_equal(r,cr)
  File "/usr/local/lib/python2.4/site-packages/numpy/testing/utils.py",
line 183, in assert_array_almost_equal
    assert cond,\
AssertionError:
Arrays are not almost equal (mismatch 100.0%):
        Array 1: [[ 19.2395622 -6.0552963j -31.4604173 -8.5979283j 
76.1476323+12.4835226j
   19.9582071 -9.7389952j  12.0353248+12.25712...
        Array 2: [[ 11.9493333  -2.2453333  15.3173333  21.6533333 
-2.2453333]
 [ -3.8426667   0.4986667  -4.5906667  -7.1866667   0.498...


----------------------------------------------------------------------
Ran 1075 tests in 5.490s

FAILED (failures=1)
<unittest.TextTestRunner object at 0x45ac5e8c>
>>> scipy.__version__
'0.4.4.1558'
>>> numpy.__version__
'0.9.4.1922'

 




More information about the Scipy-dev mailing list