[SciPy-dev] FAIL: test_imresize (test_pilutil.TestPILUtil)

Nils Wagner nwagner@iam.uni-stuttgart...
Sat Nov 1 15:28:49 CDT 2008


Hi all,

Can someone reproduce the following failure ?


======================================================================
FAIL: test_imresize (test_pilutil.TestPILUtil)
----------------------------------------------------------------------
Traceback (most recent call last):
   File 
"/usr/local/lib64/python2.5/site-packages/numpy/testing/decorators.py", 
line 82, in skipper
     return f(*args, **kwargs)
   File 
"/usr/local/lib64/python2.5/site-packages/scipy/misc/tests/test_pilutil.py", 
line 24, in test_imresize
     assert_equal(im1.shape,(11,22))
   File 
"/usr/local/lib64/python2.5/site-packages/numpy/testing/utils.py", 
line 174, in assert_equal
     assert_equal(len(actual),len(desired),err_msg,verbose)
   File 
"/usr/local/lib64/python2.5/site-packages/numpy/testing/utils.py", 
line 183, in assert_equal
     raise AssertionError(msg)
AssertionError:
Items are not equal:
  ACTUAL: 0
  DESIRED: 2

----------------------------------------------------------------------
Ran 2368 tests in 37.285s

FAILED (KNOWNFAIL=2, failures=1)
<nose.result.TextTestResult run=2368 errors=0 failures=1>
  
>>> scipy.__version__
'0.7.0.dev4902'

Cheers,
           Nils


More information about the Scipy-dev mailing list