[SciPy-dev] trunk failures

josef.pktd@gmai... josef.pktd@gmai...
Wed Dec 30 20:38:23 CST 2009


just FYI, after upgrading to numpy release

Josef

>>> numpy.version.version
'1.4.0'
>>> scipy.version.version
'0.8.0.dev6156'


======================================================================
ERROR: test_decomp.test_lapack_misaligned(<function solve at 0x01FA10F0>, (array
([[  1.734e-255,   8.189e-217,   4.025e-178,   1.903e-139,   9.344e-101,
----------------------------------------------------------------------
Traceback (most recent call last):
  File "c:\programs\python25\lib\site-packages\nose-0.11.1-py2.5.egg\nose\case.p
y", line 183, in runTest
    self.test(*self.arg)
  File "c:\josef\_progs\subversion\scipy-trunk_after\trunk\dist\scipy-0.8.0.dev6
156.win32\programs\python25\lib\site-packages\scipy\linalg\tests\test_decomp.py"
, line 1106, in check_lapack_misaligned
    func(*a,**kwargs)
  File "\Programs\Python25\Lib\site-packages\scipy\linalg\basic.py", line 127, i
n solve
  File "C:\Programs\Python25\Lib\site-packages\numpy\lib\function_base.py", line
 586, in asarray_chkfinite
    raise ValueError, "array must not contain infs or NaNs"
ValueError: array must not contain infs or NaNs

======================================================================
ERROR: test_mpmath.test_expi_complex
----------------------------------------------------------------------
Traceback (most recent call last):
  File "c:\programs\python25\lib\site-packages\nose-0.11.1-py2.5.egg\nose\case.p
y", line 183, in runTest
    self.test(*self.arg)
  File "C:\Programs\Python25\Lib\site-packages\numpy\testing\decorators.py", lin
e 146, in skipper_func
    return f(*args, **kwargs)
  File "c:\josef\_progs\subversion\scipy-trunk_after\trunk\dist\scipy-0.8.0.dev6
156.win32\programs\python25\lib\site-packages\scipy\special\tests\test_mpmath.py
", line 46, in test_expi_complex
    dataset = np.array(dataset, dtype=np.complex_)
TypeError: a float is required

======================================================================
FAIL: test_lambertw.test_values
----------------------------------------------------------------------
Traceback (most recent call last):
  File "c:\programs\python25\lib\site-packages\nose-0.11.1-py2.5.egg\nose\case.p
y", line 183, in runTest
    self.test(*self.arg)
  File "c:\josef\_progs\subversion\scipy-trunk_after\trunk\dist\scipy-0.8.0.dev6
156.win32\programs\python25\lib\site-packages\scipy\special\tests\test_lambertw.
py", line 80, in test_values
    FuncData(w, data, (0,1), 2, rtol=1e-10, atol=1e-13).check()
  File "c:\josef\_progs\subversion\scipy-trunk_after\trunk\dist\scipy-0.8.0.dev6
156.win32\programs\python25\lib\site-packages\scipy\special\tests\testutils.py",
 line 187, in check
    assert False, "\n".join(msg)
AssertionError:
Max |adiff|: 2.5797
Max |rdiff|: 3.81511
Bad results for the following points (in output 0):
(-0.44800000000000001+0.40000000000000002j)                              0j => (
-1.2370928928166736-1.6588828572971361j) != (-0.11855133765652383+0.665705343135
83418j)  (rdiff             3.8151122286225245)

----------------------------------------------------------------------
Ran 4259 tests in 91.016s

FAILED (KNOWNFAIL=10, SKIP=33, errors=3, failures=1)
<nose.result.TextTestResult run=4259 errors=3 failures=1>



I'm also getting several special.gammaincinv warnings in
stats.distributions, that I think are new, but they don't cause any
test failure

c:\josef\_progs\subversion\scipy-trunk_after\trunk\dist\scipy-0.8.0.dev6156.win3
2\programs\python25\lib\site-packages\scipy\stats\distributions.py:2050: Special
FunctionWarning: gammaincinv: failed to converge at (a, y) = (1.1844749658973861
, 0.083706058837762387): 3

  val2 = special.gammaincinv(a,1.0-q)


More information about the SciPy-Dev mailing list