[SciPy-dev] Build failure on OS X 10.5.8, Python 2.5, gcc-4.0.1

David Warde-Farley dwf@cs.toronto....
Fri Nov 6 15:23:46 CST 2009


Not sure what's going on here, it looks like an issue with the new  
complex number stuff?

Also, I see lots of warnings about "missing required architecture  
x86_64 in file". This is puzzling since I'm compiling against 32-bit  
Python...

This is with r7694 of NumPy and r6083 of SciPy.

David


compile options: '-Ibuild/src.macosx-10.3-ppc-2.5 -I/Library/ 
Frameworks/Python.framework/Versions/2.5/lib/python2.5/site-packages/ 
numpy/core/include -I/Library/Frameworks/Python.framework/Versions/2.5/ 
include/python2.5 -c'
gcc: build/src.macosx-10.3-ppc-2.5/scipy/integrate/_dopmodule.c
/usr/local/bin/gfortran -Wall -arch ppc -arch i686 -arch x86_64 -Wall - 
undefined dynamic_lookup -bundle build/temp.macosx-10.3-ppc-2.5/build/ 
src.macosx-10.3-ppc-2.5/scipy/integrate/_dopmodule.o build/ 
temp.macosx-10.3-ppc-2.5/build/src.macosx-10.3-ppc-2.5/fortranobject.o  
-Lbuild/temp.macosx-10.3-ppc-2.5 -ldop -lgfortran -o build/ 
lib.macosx-10.3-ppc-2.5/scipy/integrate/_dop.so
ld warning: in build/temp.macosx-10.3-ppc-2.5/build/src.macosx-10.3- 
ppc-2.5/scipy/integrate/_dopmodule.o, missing required architecture  
x86_64 in file
ld warning: in build/temp.macosx-10.3-ppc-2.5/build/src.macosx-10.3- 
ppc-2.5/fortranobject.o, missing required architecture x86_64 in file
building 'scipy.interpolate._fitpack' extension
compiling C sources
C compiler: gcc -arch ppc -arch i386 -isysroot /Developer/SDKs/ 
MacOSX10.4u.sdk -fno-strict-aliasing -Wno-long-double -no-cpp-precomp - 
mno-fused-madd -fno-common -dynamic -DNDEBUG -g -O3

creating build/temp.macosx-10.3-ppc-2.5/scipy/interpolate/src
compile options: '-I/Library/Frameworks/Python.framework/Versions/2.5/ 
lib/python2.5/site-packages/numpy/core/include -I/Library/Frameworks/ 
Python.framework/Versions/2.5/include/python2.5 -c'
gcc: scipy/interpolate/src/_fitpackmodule.c
In file included from scipy/interpolate/src/_fitpackmodule.c:7:
scipy/interpolate/src/__fitpack.h: In function ‘fitpack_surfit’:
scipy/interpolate/src/__fitpack.h:217: warning: passing argument 18 of  
‘surfit_’ from incompatible pointer type
scipy/interpolate/src/__fitpack.h:217: warning: passing argument 20 of  
‘surfit_’ from incompatible pointer type
scipy/interpolate/src/__fitpack.h:225: warning: passing argument 18 of  
‘surfit_’ from incompatible pointer type
scipy/interpolate/src/__fitpack.h:225: warning: passing argument 20 of  
‘surfit_’ from incompatible pointer type
In file included from scipy/interpolate/src/_fitpackmodule.c:7:
scipy/interpolate/src/__fitpack.h: In function ‘fitpack_surfit’:
scipy/interpolate/src/__fitpack.h:217: warning: passing argument 18 of  
‘surfit_’ from incompatible pointer type
scipy/interpolate/src/__fitpack.h:217: warning: passing argument 20 of  
‘surfit_’ from incompatible pointer type
scipy/interpolate/src/__fitpack.h:225: warning: passing argument 18 of  
‘surfit_’ from incompatible pointer type
scipy/interpolate/src/__fitpack.h:225: warning: passing argument 20 of  
‘surfit_’ from incompatible pointer type
scipy/interpolate/src/__fitpack.h: In function ‘fitpack_parcur’:
scipy/interpolate/src/__fitpack.h:329: warning: passing argument 12 of  
‘clocur_’ from incompatible pointer type
scipy/interpolate/src/__fitpack.h:332: warning: passing argument 14 of  
‘parcur_’ from incompatible pointer type
scipy/interpolate/src/__fitpack.h: In function ‘fitpack_parcur’:
scipy/interpolate/src/__fitpack.h:329: warning: passing argument 12 of  
‘clocur_’ from incompatible pointer type
scipy/interpolate/src/__fitpack.h:332: warning: passing argument 14 of  
‘parcur_’ from incompatible pointer type
scipy/interpolate/src/__fitpack.h: In function ‘fitpack_curfit’:
scipy/interpolate/src/__fitpack.h:408: warning: passing argument 9 of  
‘percur_’ from incompatible pointer type
scipy/interpolate/src/__fitpack.h:410: warning: passing argument 11 of  
‘curfit_’ from incompatible pointer type
scipy/interpolate/src/__fitpack.h: In function ‘fitpack_curfit’:
scipy/interpolate/src/__fitpack.h:408: warning: passing argument 9 of  
‘percur_’ from incompatible pointer type
scipy/interpolate/src/__fitpack.h:410: warning: passing argument 11 of  
‘curfit_’ from incompatible pointer type
scipy/interpolate/src/__fitpack.h: In function ‘fitpack_spl_’:
scipy/interpolate/src/__fitpack.h:474: warning: passing argument 8 of  
‘splder_’ from incompatible pointer type
scipy/interpolate/src/__fitpack.h:476: warning: passing argument 7 of  
‘splev_’ from incompatible pointer type
scipy/interpolate/src/__fitpack.h: In function ‘fitpack_spl_’:
scipy/interpolate/src/__fitpack.h:474: warning: passing argument 8 of  
‘splder_’ from incompatible pointer type
scipy/interpolate/src/__fitpack.h:476: warning: passing argument 7 of  
‘splev_’ from incompatible pointer type
scipy/interpolate/src/__fitpack.h: In function ‘fitpack_splint’:
scipy/interpolate/src/__fitpack.h:508: warning: passing argument 2 of  
‘splint_’ from incompatible pointer type
scipy/interpolate/src/__fitpack.h: In function ‘fitpack_splint’:
scipy/interpolate/src/__fitpack.h:508: warning: passing argument 2 of  
‘splint_’ from incompatible pointer type
scipy/interpolate/src/__fitpack.h: In function ‘fitpack_sproot’:
scipy/interpolate/src/__fitpack.h:537: warning: passing argument 6 of  
‘sproot_’ from incompatible pointer type
scipy/interpolate/src/__fitpack.h: In function ‘fitpack_sproot’:
scipy/interpolate/src/__fitpack.h:537: warning: passing argument 6 of  
‘sproot_’ from incompatible pointer type
scipy/interpolate/src/__fitpack.h: In function ‘fitpack_spalde’:
scipy/interpolate/src/__fitpack.h:571: warning: passing argument 4 of  
‘spalde_’ from incompatible pointer type
scipy/interpolate/src/__fitpack.h: In function ‘fitpack_spalde’:
scipy/interpolate/src/__fitpack.h:571: warning: passing argument 4 of  
‘spalde_’ from incompatible pointer type
scipy/interpolate/src/__fitpack.h: In function ‘fitpack_insert’:
scipy/interpolate/src/__fitpack.h:604: warning: passing argument 10 of  
‘insert_’ from incompatible pointer type
scipy/interpolate/src/__fitpack.h: In function ‘fitpack_insert’:
scipy/interpolate/src/__fitpack.h:604: warning: passing argument 10 of  
‘insert_’ from incompatible pointer type
/usr/local/bin/gfortran -Wall -arch ppc -arch i686 -arch x86_64 -Wall - 
undefined dynamic_lookup -bundle build/temp.macosx-10.3-ppc-2.5/scipy/ 
interpolate/src/_fitpackmodule.o -Lbuild/temp.macosx-10.3-ppc-2.5 - 
lfitpack -lgfortran -o build/lib.macosx-10.3-ppc-2.5/scipy/interpolate/ 
_fitpack.so
ld warning: in build/temp.macosx-10.3-ppc-2.5/scipy/interpolate/src/ 
_fitpackmodule.o, missing required architecture x86_64 in file
building 'scipy.interpolate.dfitpack' extension
compiling C sources
C compiler: gcc -arch ppc -arch i386 -isysroot /Developer/SDKs/ 
MacOSX10.4u.sdk -fno-strict-aliasing -Wno-long-double -no-cpp-precomp - 
mno-fused-madd -fno-common -dynamic -DNDEBUG -g -O3

creating build/temp.macosx-10.3-ppc-2.5/build/src.macosx-10.3-ppc-2.5/ 
scipy/interpolate
creating build/temp.macosx-10.3-ppc-2.5/build/src.macosx-10.3-ppc-2.5/ 
scipy/interpolate/src
compile options: '-Ibuild/src.macosx-10.3-ppc-2.5 -I/Library/ 
Frameworks/Python.framework/Versions/2.5/lib/python2.5/site-packages/ 
numpy/core/include -I/Library/Frameworks/Python.framework/Versions/2.5/ 
include/python2.5 -c'
gcc: build/src.macosx-10.3-ppc-2.5/scipy/interpolate/src/ 
dfitpackmodule.c
compiling Fortran sources
Fortran f77 compiler: /usr/local/bin/gfortran -Wall -ffixed-form -fno- 
second-underscore -arch ppc -arch i686 -arch x86_64 -fPIC -O3 -funroll- 
loops
Fortran f90 compiler: /usr/local/bin/gfortran -Wall -fno-second- 
underscore -arch ppc -arch i686 -arch x86_64 -fPIC -O3 -funroll-loops
Fortran fix compiler: /usr/local/bin/gfortran -Wall -ffixed-form -fno- 
second-underscore -Wall -fno-second-underscore -arch ppc -arch i686 - 
arch x86_64 -fPIC -O3 -funroll-loops
compile options: '-Ibuild/src.macosx-10.3-ppc-2.5 -I/Library/ 
Frameworks/Python.framework/Versions/2.5/lib/python2.5/site-packages/ 
numpy/core/include -I/Library/Frameworks/Python.framework/Versions/2.5/ 
include/python2.5 -c'
gfortran:f77: build/src.macosx-10.3-ppc-2.5/scipy/interpolate/src/ 
dfitpack-f2pywrappers.f
/usr/local/bin/gfortran -Wall -arch ppc -arch i686 -arch x86_64 -Wall - 
undefined dynamic_lookup -bundle build/temp.macosx-10.3-ppc-2.5/build/ 
src.macosx-10.3-ppc-2.5/scipy/interpolate/src/dfitpackmodule.o build/ 
temp.macosx-10.3-ppc-2.5/build/src.macosx-10.3-ppc-2.5/fortranobject.o  
build/temp.macosx-10.3-ppc-2.5/build/src.macosx-10.3-ppc-2.5/scipy/ 
interpolate/src/dfitpack-f2pywrappers.o -Lbuild/temp.macosx-10.3- 
ppc-2.5 -lfitpack -lgfortran -o build/lib.macosx-10.3-ppc-2.5/scipy/ 
interpolate/dfitpack.so
ld warning: in build/temp.macosx-10.3-ppc-2.5/build/src.macosx-10.3- 
ppc-2.5/scipy/interpolate/src/dfitpackmodule.o, missing required  
architecture x86_64 in file
ld warning: in build/temp.macosx-10.3-ppc-2.5/build/src.macosx-10.3- 
ppc-2.5/fortranobject.o, missing required architecture x86_64 in file
building 'scipy.interpolate._interpolate' extension
compiling C++ sources
C compiler: g++ -arch ppc -arch i386 -isysroot /Developer/SDKs/ 
MacOSX10.4u.sdk -fno-strict-aliasing -Wno-long-double -no-cpp-precomp - 
mno-fused-madd -fno-common -dynamic -DNDEBUG -g -O3

compile options: '-Iscipy/interpolate/src -I/Library/Frameworks/ 
Python.framework/Versions/2.5/lib/python2.5/site-packages/numpy/core/ 
include -I/Library/Frameworks/Python.framework/Versions/2.5/include/ 
python2.5 -c'
g++: scipy/interpolate/src/_interpolate.cpp
In file included from /Developer/SDKs/MacOSX10.4u.sdk/usr/include/c++/ 
4.0.0/backward/complex.h:31,
                  from /Library/Frameworks/Python.framework/Versions/ 
2.5/lib/python2.5/site-packages/numpy/core/include/numpy/npy_common.h: 
101,
                  from /Library/Frameworks/Python.framework/Versions/ 
2.5/lib/python2.5/site-packages/numpy/core/include/numpy/ 
ndarrayobject.h:68,
                  from /Library/Frameworks/Python.framework/Versions/ 
2.5/lib/python2.5/site-packages/numpy/core/include/numpy/arrayobject.h: 
14,
                  from scipy/interpolate/src/_interpolate.cpp:5:
/Developer/SDKs/MacOSX10.4u.sdk/usr/include/c++/4.0.0/backward/ 
backward_warning.h:32:2: warning: #warning This file includes at least  
one deprecated or antiquateIn file included from /Developer/SDKs/ 
MacOSX10.4u.sdk/usr/include/c++/4.0.0/backward/complex.h:31d,
                  from /Library/Frameworks/Python.framework/Versions/ 
2.5/lib/python2.5/site-packages/numpy/core/include/numpy/npy_common.h: 
101 h,
                  from /Library/Frameworks/Python.framework/Versions/ 
2.5/lib/python2.5/site-packages/numpy/core/include/numpy/ 
ndarrayobject.h:68ea,
                  from /Library/Frameworks/Python.framework/Versions/ 
2.5/lib/python2.5/site-packages/numpy/core/include/numpy/arrayobject.h: 
14de,
                  from scipy/interpolate/src/_interpolate.cpp:5r:
./Developer/SDKs/MacOSX10.4u.sdk/usr/include/c++/4.0.0/backward/ 
backward_warning.h:32:2:  Pleawarning: #warning Thiss fiele c  
oinnscilduedre using one of s at lethe 32 headersast  onef oundepd in  
section 17.4.1.2 orecf the C++ stateandd or antiquatedard. Examples   
hinecadleurd.e Pleas seu bcsotnitsuitdienrg u stihne g< Xo> header for  
ne tofh et <hXe 32 headers. found in section 17.4.1.2h o>f  thhee aCd+e 
+r  sftoarn dCa+rd+.  iEnxcalmpuldeess ,i nocrl u<dei suobstituting  
thstree <X> aheadmer>  fori nsttheea d<X .ohf>  htehea ddeer pfroerca  
tCe+d+  ihnecaldeurd es, <or io<iosstreatrema.mh>. To disabl>e   
tihnsitse awdarn ionfg t huese  d-epWrneo-decaprecatedt.
ed header <iostream.h>. To disable this warning use -Wno-deprecated.
/Developer/SDKs/MacOSX10.4u.sdk/usr/include/c++/4.0.0/cmath:85: error:  
template with C linkage
/Developer/SDKs/MacOSX10.4u.sdk/usr/include/c++/4.0.0/cmath: In  
function ‘float std::abs(float)’:
/Developer/SDKs/MacOSX10.4u.sdk/usr/include/c++/4.0.0/cmath:92: error:  
declaration of C function ‘float std::abs(float)’ conflicts with
/Developer/SDKs/MacOSX10.4u.sdk/usr/include/c++/4.0.0/cmath:88: error:  
previous declaration ‘double std::abs(double)’ here
/Developer/SDKs/MacOSX10.4u.sdk/usr/include/c++/4.0.0/cmath: In  
function ‘long double std::abs(long double)’:
/Developer/SDKs/MacOSX10.4u.sdk/usr/include/c++/4.0.0/cmath:96: error:  
declaration of C function ‘long double std::abs(long double)’  
conflicts with
/Developer/SDKs/MacOSX10.4u.sdk/usr/include/c++/4.0.0/cmath:92: error:  
previous declaration ‘float std::abs(float)’ here
/Developer/SDKs/MacOSX10.4u.sdk/usr/include/c++/4.0.0/cmath: In  
function ‘long double std::acos(long double)’:
/Developer/SDKs/MacOSX10.4u.sdk/usr/include/c++/4.0.0/cmath:106:  
error: declaration of C function ‘long double std::acos(long double)’  
conflicts with
/Developer/SDKs/MacOSX10.4u.sdk/usr/include/c++/4.0.0/cmath:102:  
error: previous declaration ‘float std::acos(float)’ here
/Developer/SDKs/MacOSX10.4u.sdk/usr/include/c++/4.0.0/cmath: At global  
scope:
/Developer/SDKs/MacOSX10.4u.sdk/usr/include/c++/4.0.0/cmath:111:  
error: template with C linkage
/Developer/SDKs/MacOSX10.4u.sdk/usr/include/c++/4.0.0/cmath: In  
function ‘long double std::asin(long double)’:
/Developer/SDKs/MacOSX10.4u.sdk/usr/include/c++/4.0.0/cmath:123:  
error: declaration of C function ‘long double std::asin(long double)’  
conflicts with
/Developer/SDKs/MacOSX10.4u.sdk/usr/include/c++/4.0.0/cmath:119:  
error: previous declaration ‘float std::asin(float)’ here
/Developer/SDKs/MacOSX10.4u.sdk/usr/include/c++/4.0.0/cmath: At global  
scope:
/Developer/SDKs/MacOSX10.4u.sdk/usr/include/c++/4.0.0/cmath:128:  
error: template with C linkage
/Developer/SDKs/MacOSX10.4u.sdk/usr/include/c++/4.0.0/cmath: In  
function ‘long double std::atan(long double)’:
/Developer/SDKs/MacOSX10.4u.sdk/usr/include/c++/4.0.0/cmath:138:  
error: declaration of C function ‘long double std::atan(long double)’  
conflicts with
/Developer/SDKs/MacOSX10.4u.sdk/usr/include/c++/4.0.0/cmath:134:  
error: previous declaration ‘float std::atan(float)’ here
/Developer/SDKs/MacOSX10.4u.sdk/usr/include/c++/4.0.0/cmath: At global  
scope:
/Developer/SDKs/MacOSX10.4u.sdk/usr/include/c++/4.0.0/cmath:143:  
error: template with C linkage
/Developer/SDKs/MacOSX10.4u.sdk/usr/include/c++/4.0.0/cmath: In  
function ‘long double std::atan2(long double, long double)’:
/Developer/SDKs/MacOSX10.4u.sdk/usr/include/c++/4.0.0/cmath:153:  
error: declaration of C function ‘long double std::atan2(long double,  
long double)’ conflicts with
/Developer/SDKs/MacOSX10.4u.sdk/usr/include/c++/4.0.0/cmath:149:  
error: previous declaration ‘float std::atan2(float, float)’ here
/Developer/SDKs/MacOSX10.4u.sdk/usr/include/c++/4.0.0/cmath: At global  
scope:
/Developer/SDKs/MacOSX10.4u.sdk/usr/include/c++/4.0.0/cmath:159:  
error: template with C linkage
/Developer/SDKs/MacOSX10.4u.sdk/usr/include/c++/4.0.0/cmath: In  
function ‘long double std::ceil(long double)’:
/Developer/SDKs/MacOSX10.4u.sdk/usr/include/c++/4.0.0/cmath:169:  
error: declaration of C function ‘long double std::ceil(long double)’  
conflicts with
/Developer/SDKs/MacOSX10.4u.sdk/usr/include/c++/4.0.0/cmath:165:  
error: previous declaration ‘float std::ceil(float)’ here
/Developer/SDKs/MacOSX10.4u.sdk/usr/include/c++/4.0.0/cmath: At global  
scope:
/Developer/SDKs/MacOSX10.4u.sdk/usr/include/c++/4.0.0/cmath:174:  
error: template with C linkage
/Developer/SDKs/MacOSX10.4u.sdk/usr/include/c++/4.0.0/cmath: In  
function ‘long double std::cos(long double)’:
/Developer/SDKs/MacOSX10.4u.sdk/usr/include/c++/4.0.0/cmath:184:  
error: declaration of C function ‘long double std::cos(long double)’  
conflicts with
/Developer/SDKs/MacOSX10.4u.sdk/usr/include/c++/4.0.0/cmath:180:  
error: previous declaration ‘float std::cos(float)’ here
/Developer/SDKs/MacOSX10.4u.sdk/usr/include/c++/4.0.0/cmath: At global  
scope:
/Developer/SDKs/MacOSX10.4u.sdk/usr/include/c++/4.0.0/cmath:189:  
error: template with C linkage
/Developer/SDKs/MacOSX10.4u.sdk/usr/include/c++/4.0.0/cmath:85: error:  
template with C linkage
/Developer/SDKs/MacOSX10.4u.sdk/usr/include/c++/4.0.0/cmath: In  
function ‘float std::abs(float)’:
/Developer/SDKs/MacOSX10.4u.sdk/usr/include/c++/4.0.0/cmath:92: error:  
declaration of C function ‘float std::abs(float)’ conflicts with
/Developer/SDKs/MacOSX10.4u.sdk/usr/include/c++/4.0.0/cmath:88: error:  
previous declaration ‘double std::abs(double)’ here
/Developer/SDKs/MacOSX10.4u.sdk/usr/include/c++/4.0.0/cmath: In  
function ‘long double std::abs(long double)’:
/Developer/SDKs/MacOSX10.4u.sdk/usr/include/c++/4.0.0/cmath:96: error:  
declaration of C function ‘long double std::abs(long double)’  
conflicts with
/Developer/SDKs/MacOSX10.4u.sdk/usr/include/c++/4.0.0/cmath:92: error:  
previous declaration ‘float std::abs(float)’ here
/Developer/SDKs/MacOSX10.4u.sdk/usr/include/c++/4.0.0/cmath: In  
function ‘long double std::acos(long double)’:
/Developer/SDKs/MacOSX10.4u.sdk/usr/include/c++/4.0.0/cmath:106:  
error: declaration of C function ‘long double std::acos(long double)’  
conflicts with
/Developer/SDKs/MacOSX10.4u.sdk/usr/include/c++/4.0.0/cmath: In  
function ‘long double std::cosh(long double)’:
/Developer/SDKs/MacOSX10.4u.sdk/usr/include/c++/4.0.0/cmath:199:  
error: declaration of C function ‘long double std::cosh(long double)’  
conflicts with
/Developer/SDKs/MacOSX10.4u.sdk/usr/include/c++/4.0.0/cmath:195:  
error: previous declaration ‘float std::cosh(float)’ here
/Developer/SDKs/MacOSX10.4u.sdk/usr/include/c++/4.0.0/cmath:102:  
error: previous declaration ‘float std::acos(float)’ here
/Developer/SDKs/MacOSX10.4u.sdk/usr/include/c++/4.0.0/cmath: At global  
scope:
/Developer/SDKs/MacOSX10.4u.sdk/usr/include/c++/4.0.0/cmath:204:  
error: template with C linkage
/Developer/SDKs/MacOSX10.4u.sdk/usr/include/c++/4.0.0/cmath: At global  
scope:
/Developer/SDKs/MacOSX10.4u.sdk/usr/include/c++/4.0.0/cmath:111:  
error: template with C linkage
/Developer/SDKs/MacOSX10.4u.sdk/usr/include/c++/4.0.0/cmath: In  
function ‘long double std::asin(long double)’:
/Developer/SDKs/MacOSX10.4u.sdk/usr/include/c++/4.0.0/cmath:123:  
error: declaration of C function ‘long double std::asin(long double)’  
conflicts with
/Developer/SDKs/MacOSX10.4u.sdk/usr/include/c++/4.0.0/cmath:119:  
error: previous declaration ‘float std::asin(float)’ here
/Developer/SDKs/MacOSX10.4u.sdk/usr/include/c++/4.0.0/cmath: In  
function ‘long double std::exp(long double)’:
/Developer/SDKs/MacOSX10.4u.sdk/usr/include/c++/4.0.0/cmath:214:  
error: declaration of C function ‘long double std::exp(long double)’  
conflicts with
/Developer/SDKs/MacOSX10.4u.sdk/usr/include/c++/4.0.0/cmath:210:  
error: previous declaration ‘float std::exp(float)’ here
/Developer/SDKs/MacOSX10.4u.sdk/usr/include/c++/4.0.0/cmath: At global  
scope:
/Developer/SDKs/MacOSX10.4u.sdk/usr/include/c++/4.0.0/cmath:128:  
error: template with C linkage
/Developer/SDKs/MacOSX10.4u.sdk/usr/include/c++/4.0.0/cmath: At global  
scope:
/Developer/SDKs/MacOSX10.4u.sdk/usr/include/c++/4.0.0/cmath:219:  
error: template with C linkage
/Developer/SDKs/MacOSX10.4u.sdk/usr/include/c++/4.0.0/cmath: In  
function ‘long double std::atan(long double)’:
/Developer/SDKs/MacOSX10.4u.sdk/usr/include/c++/4.0.0/cmath:138:  
error: declaration of C function ‘long double std::atan(long double)’  
conflicts with
/Developer/SDKs/MacOSX10.4u.sdk/usr/include/c++/4.0.0/cmath:134:  
error: previous declaration ‘float std::atan(float)’ here
/Developer/SDKs/MacOSX10.4u.sdk/usr/include/c++/4.0.0/cmath: At global  
scope:
/Developer/SDKs/MacOSX10.4u.sdk/usr/include/c++/4.0.0/cmath:143:  
error: template with C linkage
/Developer/SDKs/MacOSX10.4u.sdk/usr/include/c++/4.0.0/cmath: In  
function ‘long double std::fabs(long double)’:
/Developer/SDKs/MacOSX10.4u.sdk/usr/include/c++/4.0.0/cmath:229:  
error: declaration of C function ‘long double std::fabs(long double)’  
conflicts with
/Developer/SDKs/MacOSX10.4u.sdk/usr/include/c++/4.0.0/cmath:225:  
error: previous declaration ‘float std::fabs(float)’ here
/Developer/SDKs/MacOSX10.4u.sdk/usr/include/c++/4.0.0/cmath: In  
function ‘long double std::atan2(long double, long double)’:
/Developer/SDKs/MacOSX10.4u.sdk/usr/include/c++/4.0.0/cmath:153:  
error: declaration of C function ‘long double std::atan2(long double,  
long double)’ conflicts with
/Developer/SDKs/MacOSX10.4u.sdk/usr/include/c++/4.0.0/cmath:149:  
error: previous declaration ‘float std::atan2(float, float)’ here
/Developer/SDKs/MacOSX10.4u.sdk/usr/include/c++/4.0.0/cmath: At global  
scope:
/Developer/SDKs/MacOSX10.4u.sdk/usr/include/c++/4.0.0/cmath:159:  
error: template with C linkage
/Developer/SDKs/MacOSX10.4u.sdk/usr/include/c++/4.0.0/cmath: At global  
scope:
/Developer/SDKs/MacOSX10.4u.sdk/usr/include/c++/4.0.0/cmath:234:  
error: template with C linkage
/Developer/SDKs/MacOSX10.4u.sdk/usr/include/c++/4.0.0/cmath: In  
function ‘long double std::ceil(long double)’:
/Developer/SDKs/MacOSX10.4u.sdk/usr/include/c++/4.0.0/cmath:169:  
error: declaration of C function ‘long double std::ceil(long double)’  
conflicts with
/Developer/SDKs/MacOSX10.4u.sdk/usr/include/c++/4.0.0/cmath:165:  
error: previous declaration ‘float std::ceil(float)’ here
/Developer/SDKs/MacOSX10.4u.sdk/usr/include/c++/4.0.0/cmath: At global  
scope:
/Developer/SDKs/MacOSX10.4u.sdk/usr/include/c++/4.0.0/cmath:174:  
error: template with C linkage
/Developer/SDKs/MacOSX10.4u.sdk/usr/include/c++/4.0.0/cmath: In  
function ‘long double std::floor(long double)’:
/Developer/SDKs/MacOSX10.4u.sdk/usr/include/c++/4.0.0/cmath:244:  
error: declaration of C function ‘long double std::floor(long double)’  
conflicts with
/Developer/SDKs/MacOSX10.4u.sdk/usr/include/c++/4.0.0/cmath:240:  
error: previous declaration ‘float std::floor(float)’ here
/Developer/SDKs/MacOSX10.4u.sdk/usr/include/c++/4.0.0/cmath: In  
function ‘long double std::cos(long double)’:
/Developer/SDKs/MacOSX10.4u.sdk/usr/include/c++/4.0.0/cmath:184:  
error: declaration of C function ‘long double std::cos(long double)’  
conflicts with
/Developer/SDKs/MacOSX10.4u.sdk/usr/include/c++/4.0.0/cmath:180:  
error: previous declaration ‘float std::cos(float)’ here
/Developer/SDKs/MacOSX10.4u.sdk/usr/include/c++/4.0.0/cmath: At global  
scope:
/Developer/SDKs/MacOSX10.4u.sdk/usr/include/c++/4.0.0/cmath:249:  
error: template with C linkage
/Developer/SDKs/MacOSX10.4u.sdk/usr/include/c++/4.0.0/cmath: At global  
scope:
/Developer/SDKs/MacOSX10.4u.sdk/usr/include/c++/4.0.0/cmath:189:  
error: template with C linkage
/Developer/SDKs/MacOSX10.4u.sdk/usr/include/c++/4.0.0/cmath: In  
function ‘long double std::fmod(long double, long double)’:
/Developer/SDKs/MacOSX10.4u.sdk/usr/include/c++/4.0.0/cmath:259:  
error: declaration of C function ‘long double std::fmod(long double,  
long double)’ conflicts with
/Developer/SDKs/MacOSX10.4u.sdk/usr/include/c++/4.0.0/cmath: In  
function ‘long double std::cosh(long double)’:
/Developer/SDKs/MacOSX10.4u.sdk/usr/include/c++/4.0.0/cmath:199:  
error: declaration of C function ‘long double std::cosh(long double)’  
conflicts with
/Developer/SDKs/MacOSX10.4u.sdk/usr/include/c++/4.0.0/cmath:255:  
error: previous declaration ‘float std::fmod(float, float)’ here
/Developer/SDKs/MacOSX10.4u.sdk/usr/include/c++/4.0.0/cmath:195:  
error: previous declaration ‘float std::cosh(float)’ here
/Developer/SDKs/MacOSX10.4u.sdk/usr/include/c++/4.0.0/cmath: At global  
scope:
/Developer/SDKs/MacOSX10.4u.sdk/usr/include/c++/4.0.0/cmath:204:  
error: template with C linkage
/Developer/SDKs/MacOSX10.4u.sdk/usr/include/c++/4.0.0/cmath: In  
function ‘long double std::frexp(long double, int*)’:
/Developer/SDKs/MacOSX10.4u.sdk/usr/include/c++/4.0.0/cmath:269:  
error: declaration of C function ‘long double std::frexp(long double,  
int*)’ conflicts with
/Developer/SDKs/MacOSX10.4u.sdk/usr/include/c++/4.0.0/cmath:265:  
error: previous declaration ‘float std::frexp(float, int*)’ here
/Developer/SDKs/MacOSX10.4u.sdk/usr/include/c++/4.0.0/cmath: In  
function ‘long double std::exp(long double)’:
/Developer/SDKs/MacOSX10.4u.sdk/usr/include/c++/4.0.0/cmath:214:  
error: declaration of C function ‘long double std::exp(long double)’  
conflicts with
/Developer/SDKs/MacOSX10.4u.sdk/usr/include/c++/4.0.0/cmath:210:  
error: previous declaration ‘float std::exp(float)’ here
/Developer/SDKs/MacOSX10.4u.sdk/usr/include/c++/4.0.0/cmath: At global  
scope:
/Developer/SDKs/MacOSX10.4u.sdk/usr/include/c++/4.0.0/cmath:274:  
error: template with C linkage
/Developer/SDKs/MacOSX10.4u.sdk/usr/include/c++/4.0.0/cmath: At global  
scope:
/Developer/SDKs/MacOSX10.4u.sdk/usr/include/c++/4.0.0/cmath:219:  
error: template with C linkage
/Developer/SDKs/MacOSX10.4u.sdk/usr/include/c++/4.0.0/cmath: In  
function ‘long double std::ldexp(long double, int)’:
/Developer/SDKs/MacOSX10.4u.sdk/usr/include/c++/4.0.0/cmath:284:  
error: declaration of C function ‘long double std::ldexp(long double,  
int)’ conflicts with
/Developer/SDKs/MacOSX10.4u.sdk/usr/include/c++/4.0.0/cmath:280:  
error: previous declaration ‘float std::ldexp(float, int)’ here/ 
Developer/SDKs/MacOSX10.4u.sdk/usr/include/c++/4.0.0/cmath: In  
function ‘long double std::fabs(long double)’:
/Developer/SDKs/MacOSX10.4u.sdk/usr/include/c++/4.0.0/cmath:229:  
error: declaration of C function ‘long double std::fabs(long double)’  
conflicts with
/Developer/SDKs/MacOSX10.4u.sdk/usr/include/c++/4.0.0/cmath:225:  
error: previous declaration ‘float std::fabs(float)’ here
/Developer/SDKs/MacOSX10.4u.sdk/usr/include/c++/4.0.0/cmath: At global  
scope:
/Developer/SDKs/MacOSX10.4u.sdk/usr/include/c++/4.0.0/cmath:234:  
error: template with C linkage
/Developer/SDKs/MacOSX10.4u.sdk/usr/include/c++/4.0.0/cmath: In  
function ‘long double std::floor(long double)’:
/Developer/SDKs/MacOSX10.4u.sdk/usr/include/c++/4.0.0/cmath:244:  
error: declaration of C function ‘long double std::floor(long double)’  
conflicts with
/Developer/SDKs/MacOSX10.4u.sdk/usr/include/c++/4.0.0/cmath:240:  
error: previous declaration ‘float std::floor(float)’ here
/Developer/SDKs/MacOSX10.4u.sdk/usr/include/c++/4.0.0/cmath: At global  
scope:
/Developer/SDKs/MacOSX10.4u.sdk/usr/include/c++/4.0.0/cmath:249:  
error: template with C linkage
/Developer/SDKs/MacOSX10.4u.sdk/usr/include/c++/4.0.0/cmath: In  
function ‘long double std::fmod(long double, long double)’:
/Developer/SDKs/MacOSX10.4u.sdk/usr/include/c++/4.0.0/cmath:259:  
error: declaration of C function ‘long double std::fmod(long double,  
long double)’ conflicts with
/Developer/SDKs/MacOSX10.4u.sdk/usr/include/c++/4.0.0/cmath:255:  
error: previous declaration ‘float std::fmod(float, float)’ here
/Developer/SDKs/MacOSX10.4u.sdk/usr/include/c++/4.0.0/cmath: In  
function ‘long double std::frexp(long double, int*)’:
/Developer/SDKs/MacOSX10.4u.sdk/usr/include/c++/4.0.0/cmath:269:  
error: declaration of C function ‘long double std::frexp(long double,  
int*)’ conflicts with
/Developer/SDKs/MacOSX10.4u.sdk/usr/include/c++/4.0.0/cmath:265:  
error: previous declaration ‘float std::frexp(float, int*)’ here
/Developer/SDKs/MacOSX10.4u.sdk/usr/include/c++/4.0.0/cmath: At global  
scope:
/Developer/SDKs/MacOSX10.4u.sdk/usr/include/c++/4.0.0/cmath:274:  
error: template with C linkage
/Developer/SDKs/MacOSX10.4u.sdk/usr/include/c++/4.0.0/cmath: In  
function ‘long double std::ldexp(long double, int)’:
/Developer/SDKs/MacOSX10.4u.sdk/usr/include/c++/4.0.0/cmath:284:  
error: declaration of C function ‘long double std::ldexp(long double,  
int)’ conflicts with
/Developer/SDKs/MacOSX10.4u.sdk/usr/include/c++/4.0.0/cmath:280:  
error: previous declaration ‘float std::ldexp(float, int)’ here
/Developer/SDKs/MacOSX10.4u.sdk/usr/include/c++/4.0.0/cmath: At global  
scope:
/Developer/SDKs/MacOSX10.4u.sdk/usr/include/c++/4.0.0/cmath:289:  
error: template with C linkage
/Developer/SDKs/MacOSX10.4u.sdk/usr/include/c++/4.0.0/cmath: In  
function ‘long double std::log(long double)’:
/Developer/SDKs/MacOSX10.4u.sdk/usr/include/c++/4.0.0/cmath:299:  
error: declaration of C function ‘long double std::log(long double)’  
conflicts with
/Developer/SDKs/MacOSX10.4u.sdk/usr/include/c++/4.0.0/cmath:295:  
error: previous declaration ‘float std::log(float)’ here

/Developer/SDKs/MacOSX10.4u.sdk/usr/include/c++/4.0.0/cmath: At global  
scope:
/Developer/SDKs/MacOSX10.4u.sdk/usr/include/c++/4.0.0/cmath:304:  
error: template with C linkage
/Developer/SDKs/MacOSX10.4u.sdk/usr/include/c++/4.0.0/cmath: In  
function ‘long double std::log10(long double)’:
/Developer/SDKs/MacOSX10.4u.sdk/usr/include/c++/4.0.0/cmath:314:  
error: declaration of C function ‘long double std::log10(long double)’  
conflicts with
/Developer/SDKs/MacOSX10.4u.sdk/usr/include/c++/4.0.0/cmath:310:  
error: previous declaration ‘float std::log10(float)’ here
/Developer/SDKs/MacOSX10.4u.sdk/usr/include/c++/4.0.0/cmath: At global  
scope:
/Developer/SDKs/MacOSX10.4u.sdk/usr/include/c++/4.0.0/cmath:319:  
error: template with C linkage
/Developer/SDKs/MacOSX10.4u.sdk/usr/include/c++/4.0.0/cmath: At global  
scope:
/Developer/SDKs/MacOSX10.4u.sdk/usr/include/c++/4.0.0/cmath:289:  
error: template with C linkage
/Developer/SDKs/MacOSX10.4u.sdk/usr/include/c++/4.0.0/cmath: In  
function ‘long double std::modf(long double, long double*)’:
/Developer/SDKs/MacOSX10.4u.sdk/usr/include/c++/4.0.0/cmath:329:  
error: declaration of C function ‘long double std::modf(long double,  
long double*)’ conflicts with
/Developer/SDKs/MacOSX10.4u.sdk/usr/include/c++/4.0.0/cmath:325:  
error: previous declaration ‘float std::modf(float, float*)’ here
/Developer/SDKs/MacOSX10.4u.sdk/usr/include/c++/4.0.0/cmath: At global  
scope:
/Developer/SDKs/MacOSX10.4u.sdk/usr/include/c++/4.0.0/cmath:334:  
error: template with C linkage
/Developer/SDKs/MacOSX10.4u.sdk/usr/include/c++/4.0.0/cmath: In  
function ‘long double std::pow(long double, long double)’:
/Developer/SDKs/MacOSX10.4u.sdk/usr/include/c++/4.0.0/cmath:348:  
error: declaration of C function ‘long double std::pow(long double,  
long double)’ conflicts with
/Developer/SDKs/MacOSX10.4u.sdk/usr/include/c++/4.0.0/cmath:344:  
error: previous declaration ‘float std::pow(float, float)’ here
/Developer/SDKs/MacOSX10.4u.sdk/usr/include/c++/4.0.0/cmath:352:  
error: declaration of C function ‘double std::pow(double, int)’  
conflicts with
/Developer/SDKs/MacOSX10.4u.sdk/usr/include/c++/4.0.0/cmath:348:  
error: previous declaration ‘long double std::pow(long double, long  
double)’ here
/Developer/SDKs/MacOSX10.4u.sdk/usr/include/c++/4.0.0/cmath: In  
function ‘long double std::log(long double)’:
/Developer/SDKs/MacOSX10.4u.sdk/usr/include/c++/4.0.0/cmath:299:  
error: declaration of C function ‘long double std::log(long double)’  
conflicts with
/Developer/SDKs/MacOSX10.4u.sdk/usr/include/c++/4.0.0/cmath:295:  
error: previous declaration ‘float std::log(float)’ here
/Developer/SDKs/MacOSX10.4u.sdk/usr/include/c++/4.0.0/cmath: In  
function ‘float std::pow(float, int)’:
/Developer/SDKs/MacOSX10.4u.sdk/usr/include/c++/4.0.0/cmath:356:  
error: declaration of C function ‘float std::pow(float, int)’  
conflicts with
/Developer/SDKs/MacOSX10.4u.sdk/usr/include/c++/4.0.0/cmath:352:  
error: previous declaration ‘double std::pow(double, int)’ here
/Developer/SDKs/MacOSX10.4u.sdk/usr/include/c++/4.0.0/cmath: In  
function ‘long double std::pow(long double, int)’:
/Developer/SDKs/MacOSX10.4u.sdk/usr/include/c++/4.0.0/cmath:360:  
error: declaration of C function ‘long double std::pow(long double,  
int)’ conflicts with
/Developer/SDKs/MacOSX10.4u.sdk/usr/include/c++/4.0.0/cmath:356:  
error: previous declaration ‘float std::pow(float, int)’ here
/Developer/SDKs/MacOSX10.4u.sdk/usr/include/c++/4.0.0/cmath: At global  
scope:
/Developer/SDKs/MacOSX10.4u.sdk/usr/include/c++/4.0.0/cmath:304:  
error: template with C linkage
/Developer/SDKs/MacOSX10.4u.sdk/usr/include/c++/4.0.0/cmath: In  
function ‘long double std::sin(long double)’:
/Developer/SDKs/MacOSX10.4u.sdk/usr/include/c++/4.0.0/cmath:370:  
error: declaration of C function ‘long double std::sin(long double)’  
conflicts with
/Developer/SDKs/MacOSX10.4u.sdk/usr/include/c++/4.0.0/cmath:366:  
error: previous declaration ‘float std::sin(float)’ here
/Developer/SDKs/MacOSX10.4u.sdk/usr/include/c++/4.0.0/cmath: At global  
scope:
/Developer/SDKs/MacOSX10.4u.sdk/usr/include/c++/4.0.0/cmath:375:  
error: template with C linkage/Developer/SDKs/MacOSX10.4u.sdk/usr/ 
include/c++/4.0.0/cmath: In function ‘long double std::log10(long  
double)’:
/Developer/SDKs/MacOSX10.4u.sdk/usr/include/c++/4.0.0/cmath:314:  
error: declaration of C function ‘long double std::log10(long double)’  
conflicts with

/Developer/SDKs/MacOSX10.4u.sdk/usr/include/c++/4.0.0/cmath:310:  
error: previous declaration ‘float std::log10(float)’ here
/Developer/SDKs/MacOSX10.4u.sdk/usr/include/c++/4.0.0/cmath: At global  
scope:
/Developer/SDKs/MacOSX10.4u.sdk/usr/include/c++/4.0.0/cmath:319:  
error: template with C linkage
/Developer/SDKs/MacOSX10.4u.sdk/usr/include/c++/4.0.0/cmath: In  
function ‘long double std::sinh(long double)’:
/Developer/SDKs/MacOSX10.4u.sdk/usr/include/c++/4.0.0/cmath:385:  
error: declaration of C function ‘long double std::sinh(long double)’  
conflicts with
/Developer/SDKs/MacOSX10.4u.sdk/usr/include/c++/4.0.0/cmath:381:  
error: previous declaration ‘float std::sinh(float)’ here
/Developer/SDKs/MacOSX10.4u.sdk/usr/include/c++/4.0.0/cmath: At global  
scope:
/Developer/SDKs/MacOSX10.4u.sdk/usr/include/c++/4.0.0/cmath:390:  
error: template with C linkage
/Developer/SDKs/MacOSX10.4u.sdk/usr/include/c++/4.0.0/cmath: In  
function ‘long double std::modf(long double, long double*)’:
/Developer/SDKs/MacOSX10.4u.sdk/usr/include/c++/4.0.0/cmath:329:  
error: declaration of C function ‘long double std::modf(long double,  
long double*)’ conflicts with
/Developer/SDKs/MacOSX10.4u.sdk/usr/include/c++/4.0.0/cmath:325:  
error: previous declaration ‘float std::modf(float, float*)’ here
/Developer/SDKs/MacOSX10.4u.sdk/usr/include/c++/4.0.0/cmath: In  
function ‘long double std::sqrt(long double)’:
/Developer/SDKs/MacOSX10.4u.sdk/usr/include/c++/4.0.0/cmath:400:  
error: declaration of C function ‘long double std::sqrt(long double)’  
conflicts with
/Developer/SDKs/MacOSX10.4u.sdk/usr/include/c++/4.0.0/cmath:396:  
error: previous declaration ‘float std::sqrt(float)’ here
/Developer/SDKs/MacOSX10.4u.sdk/usr/include/c++/4.0.0/cmath: At global  
scope:
/Developer/SDKs/MacOSX10.4u.sdk/usr/include/c++/4.0.0/cmath:334:  
error: template with C linkage
/Developer/SDKs/MacOSX10.4u.sdk/usr/include/c++/4.0.0/cmath: At global  
scope:
/Developer/SDKs/MacOSX10.4u.sdk/usr/include/c++/4.0.0/cmath:405:  
error: template with C linkage
/Developer/SDKs/MacOSX10.4u.sdk/usr/include/c++/4.0.0/cmath: In  
function ‘long double std::pow(long double, long double)’:
/Developer/SDKs/MacOSX10.4u.sdk/usr/include/c++/4.0.0/cmath:348:  
error: declaration of C function ‘long double std::pow(long double,  
long double)’ conflicts with
/Developer/SDKs/MacOSX10.4u.sdk/usr/include/c++/4.0.0/cmath:344:  
error: previous declaration ‘float std::pow(float, float)’ here
/Developer/SDKs/MacOSX10.4u.sdk/usr/include/c++/4.0.0/cmath: In  
function ‘long double std::tan(long double)’:
/Developer/SDKs/MacOSX10.4u.sdk/usr/include/c++/4.0.0/cmath:415:  
error: declaration of C function ‘long double std::tan(long double)’  
conflicts with
/Developer/SDKs/MacOSX10.4u.sdk/usr/include/c++/4.0.0/cmath:411:  
error: previous declaration ‘float std::tan(float)’ here
/Developer/SDKs/MacOSX10.4u.sdk/usr/include/c++/4.0.0/cmath: In  
function ‘double std::pow(double, int)’:
/Developer/SDKs/MacOSX10.4u.sdk/usr/include/c++/4.0.0/cmath:352:  
error: declaration of C function ‘double std::pow(double, int)’  
conflicts with
/Developer/SDKs/MacOSX10.4u.sdk/usr/include/c++/4.0.0/cmath:348:  
error: previous declaration ‘long double std::pow(long double, long  
double)’ here
/Developer/SDKs/MacOSX10.4u.sdk/usr/include/c++/4.0.0/cmath: At global  
scope:
/Developer/SDKs/MacOSX10.4u.sdk/usr/include/c++/4.0.0/cmath:420:  
error: template with C linkage
/Developer/SDKs/MacOSX10.4u.sdk/usr/include/c++/4.0.0/cmath: In  
function ‘long double std::pow(long double, long double)’:
/Developer/SDKs/MacOSX10.4u.sdk/usr/include/c++/4.0.0/cmath:356:  
error: declaration of C function ‘float std::pow(float, int)’  
conflicts with
/Developer/SDKs/MacOSX10.4u.sdk/usr/include/c++/4.0.0/cmath:352:  
error: previous declaration ‘double std::pow(double, int)’ here
/Developer/SDKs/MacOSX10.4u.sdk/usr/include/c++/4.0.0/cmath: In  
function ‘long double std::tanh(long double)’:
/Developer/SDKs/MacOSX10.4u.sdk/usr/include/c++/4.0.0/cmath:430:  
error: declaration of C function ‘long double std::tanh(long double)’  
conflicts with
/Developer/SDKs/MacOSX10.4u.sdk/usr/include/c++/4.0.0/cmath:426:  
error: previous declaration ‘float std::tanh(float)’ here
/Developer/SDKs/MacOSX10.4u.sdk/usr/include/c++/4.0.0/cmath: In  
function ‘long double std::pow(long double, int)’:
/Developer/SDKs/MacOSX10.4u.sdk/usr/include/c++/4.0.0/cmath:360:  
error: declaration of C function ‘long double std::pow(long double,  
int)’ conflicts with
/Developer/SDKs/MacOSX10.4u.sdk/usr/include/c++/4.0.0/cmath:356:  
error: previous declaration ‘float std::pow(float, int)’ here
/Developer/SDKs/MacOSX10.4u.sdk/usr/include/c++/4.0.0/cmath: At global  
scope:
/Developer/SDKs/MacOSX10.4u.sdk/usr/include/c++/4.0.0/cmath:435:  
error: template with C linkage
/Developer/SDKs/MacOSX10.4u.sdk/usr/include/c++/4.0.0/cmath:448:  
error: template with C linkage
/Developer/SDKs/MacOSX10.4u.sdk/usr/include/c++/4.0.0/cmath:452:  
error: template with C linkage
/Developer/SDKs/MacOSX10.4u.sdk/usr/include/c++/4.0.0/cmath:456:  
error: template with C linkage
/Developer/SDKs/MacOSX10.4u.sdk/usr/include/c++/4.0.0/cmath:460:  
error: template with C linkage
/Developer/SDKs/MacOSX10.4u.sdk/usr/include/c++/4.0.0/cmath:464:  
error: template with C linkage
/Developer/SDKs/MacOSX10.4u.sdk/usr/include/c++/4.0.0/cmath:468:  
error: template with C linkage
/Developer/SDKs/MacOSX10.4u.sdk/usr/include/c++/4.0.0/cmath:472:  
error: template with C linkage
/Developer/SDKs/MacOSX10.4u.sdk/usr/include/c++/4.0.0/cmath:477:  
error: template with C linkage
/Developer/SDKs/MacOSX10.4u.sdk/usr/include/c++/4.0.0/cmath:482:  
error: template with C linkage
/Developer/SDKs/MacOSX10.4u.sdk/usr/include/c++/4.0.0/cmath: In  
function ‘long double std::sin(long double)’:
/Developer/SDKs/MacOSX10.4u.sdk/usr/include/c++/4.0.0/cmath:370:  
error: declaration of C function ‘long double std::sin(long double)’  
conflicts with
/Developer/SDKs/MacOSX10.4u.sdk/usr/include/c++/4.0.0/cmath:366:  
error: previous declaration ‘float std::sin(float)’ here
/Developer/SDKs/MacOSX10.4u.sdk/usr/include/c++/4.0.0/cmath:486:  
error: template with C linkage
/Developer/SDKs/MacOSX10.4u.sdk/usr/include/c++/4.0.0/cmath:491:  
error: template with C linkage
/Developer/SDKs/MacOSX10.4u.sdk/usr/include/c++/4.0.0/cmath:496:  
error: template with C linkage
/Developer/SDKs/MacOSX10.4u.sdk/usr/include/c++/4.0.0/cmath:518:  
error: template with C linkage
/Developer/SDKs/MacOSX10.4u.sdk/usr/include/c++/4.0.0/cmath: At global  
scope:
/Developer/SDKs/MacOSX10.4u.sdk/usr/include/c++/4.0.0/cmath:375:  
error: template with C linkage
/Developer/SDKs/MacOSX10.4u.sdk/usr/include/c++/4.0.0/cmath:522:  
error: template with C linkage
/Developer/SDKs/MacOSX10.4u.sdk/usr/include/c++/4.0.0/cmath:526:  
error: template with C linkage
/Developer/SDKs/MacOSX10.4u.sdk/usr/include/c++/4.0.0/cmath:530:  
error: template with C linkage
/Developer/SDKs/MacOSX10.4u.sdk/usr/include/c++/4.0.0/cmath: In  
function ‘long double std::sinh(long double)’:
/Developer/SDKs/MacOSX10.4u.sdk/usr/include/c++/4.0.0/cmath:385:  
error: declaration of C function ‘long double std::sinh(long double)’  
conflicts with
/Developer/SDKs/MacOSX10.4u.sdk/usr/include/c++/4.0.0/cmath:381:  
error: previous declaration ‘float std::sinh(float)’ here/Developer/ 
SDKs/MacOSX10.4u.sdk/usr/include/c++/4.0.0/cmath:534: error: template  
with C linkage
/Developer/SDKs/MacOSX10.4u.sdk/usr/include/c++/4.0.0/cmath:538:  
error: template with C linkage

/Developer/SDKs/MacOSX10.4u.sdk/usr/include/c++/4.0.0/cmath:542:  
error: template with C linkage
/Developer/SDKs/MacOSX10.4u.sdk/usr/include/c++/4.0.0/cmath:547:  
error: template with C linkage
/Developer/SDKs/MacOSX10.4u.sdk/usr/include/c++/4.0.0/cmath: At global  
scope:
/Developer/SDKs/MacOSX10.4u.sdk/usr/include/c++/4.0.0/cmath:390:  
error: template with C linkage
/Developer/SDKs/MacOSX10.4u.sdk/usr/include/c++/4.0.0/cmath:552:  
error: template with C linkage
/Developer/SDKs/MacOSX10.4u.sdk/usr/include/c++/4.0.0/cmath:557:  
error: template with C linkage
/Developer/SDKs/MacOSX10.4u.sdk/usr/include/c++/4.0.0/cmath:562:  
error: template with C linkage
/Developer/SDKs/MacOSX10.4u.sdk/usr/include/c++/4.0.0/cmath: In  
function ‘long double std::sqrt(long double)’:
/Developer/SDKs/MacOSX10.4u.sdk/usr/include/c++/4.0.0/cmath:400:  
error: declaration of C function ‘long double std::sqrt(long double)’  
conflicts with
/Developer/SDKs/MacOSX10.4u.sdk/usr/include/c++/4.0.0/cmath:567:  
error: template with C linkage/Developer/SDKs/MacOSX10.4u.sdk/usr/ 
include/c++/4.0.0/cmath:396: error: previous declaration ‘float  
std::sqrt(float)’ here

/Developer/SDKs/MacOSX10.4u.sdk/usr/include/c++/4.0.0/bits/cmath.tcc: 
39: error: template with C linkage
/Developer/SDKs/MacOSX10.4u.sdk/usr/include/c++/4.0.0/cmath: At global  
scope:
/Developer/SDKs/MacOSX10.4u.sdk/usr/include/c++/4.0.0/cmath:405:  
error: template with C linkage
/Developer/SDKs/MacOSX10.4u.sdk/usr/include/c++/4.0.0/cmath: In  
function ‘long double std::tan(long double)’:
/Developer/SDKs/MacOSX10.4u.sdk/usr/include/c++/4.0.0/cmath:415:  
error: declaration of C function ‘long double std::tan(long double)’  
conflicts with
/Developer/SDKs/MacOSX10.4u.sdk/usr/include/c++/4.0.0/cmath:411:  
error: previous declaration ‘float std::tan(float)’ here
/Developer/SDKs/MacOSX10.4u.sdk/usr/include/c++/4.0.0/cmath: At global  
scope:
/Developer/SDKs/MacOSX10.4u.sdk/usr/include/c++/4.0.0/cmath:420:  
error: template with C linkage
/Developer/SDKs/MacOSX10.4u.sdk/usr/include/c++/4.0.0/cmath: In  
function ‘long double std::tanh(long double)’:
/Developer/SDKs/MacOSX10.4u.sdk/usr/include/c++/4.0.0/cmath:430:  
error: declaration of C function ‘long double std::tanh(long double)’  
conflicts with
/Developer/SDKs/MacOSX10.4u.sdk/usr/include/c++/4.0.0/cmath:426:  
error: previous declaration ‘float std::tanh(float)’ here
/Developer/SDKs/MacOSX10.4u.sdk/usr/include/c++/4.0.0/cmath: At global  
scope:
/Developer/SDKs/MacOSX10.4u.sdk/usr/include/c++/4.0.0/cmath:435:  
error: template with C linkage
/Developer/SDKs/MacOSX10.4u.sdk/usr/include/c++/4.0.0/cmath:448:  
error: template with C linkage
/Developer/SDKs/MacOSX10.4u.sdk/usr/include/c++/4.0.0/cmath:452:  
error: template with C linkage
/Developer/SDKs/MacOSX10.4u.sdk/usr/include/c++/4.0.0/cmath:456:  
error: template with C linkage
/Developer/SDKs/MacOSX10.4u.sdk/usr/include/c++/4.0.0/cmath:460:  
error: template with C linkage
/Developer/SDKs/MacOSX10.4u.sdk/usr/include/c++/4.0.0/cmath:464:  
error: template with C linkage
/Developer/SDKs/MacOSX10.4u.sdk/usr/include/c++/4.0.0/cmath:468:  
error: template with C linkage
/Developer/SDKs/MacOSX10.4u.sdk/usr/include/c++/4.0.0/cmath:472:  
error: template with C linkage
/Developer/SDKs/MacOSX10.4u.sdk/usr/include/c++/4.0.0/cmath:477:  
error: template with C linkage
/Developer/SDKs/MacOSX10.4u.sdk/usr/include/c++/4.0.0/cmath:482:  
error: template with C linkage
/Developer/SDKs/MacOSX10.4u.sdk/usr/include/c++/4.0.0/cmath:486:  
error: template with C linkage
/Developer/SDKs/MacOSX10.4u.sdk/usr/include/c++/4.0.0/cmath:491:  
error: template with C linkage
/Developer/SDKs/MacOSX10.4u.sdk/usr/include/c++/4.0.0/cmath:496:  
error: template with C linkage
/Developer/SDKs/MacOSX10.4u.sdk/usr/include/c++/4.0.0/cmath:518:  
error: template with C linkage
/Developer/SDKs/MacOSX10.4u.sdk/usr/include/c++/4.0.0/cmath:522:  
error: template with C linkage
/Developer/SDKs/MacOSX10.4u.sdk/usr/include/c++/4.0.0/cmath:526:  
error: template with C linkage
/Developer/SDKs/MacOSX10.4u.sdk/usr/include/c++/4.0.0/cmath:530:  
error: template with C linkage
/Developer/SDKs/MacOSX10.4u.sdk/usr/include/c++/4.0.0/cmath:534:  
error: template with C linkage
/Developer/SDKs/MacOSX10.4u.sdk/usr/include/c++/4.0.0/cmath:538:  
error: template with C linkage
/Developer/SDKs/MacOSX10.4u.sdk/usr/include/c++/4.0.0/cmath:542:  
error: template with C linkage
/Developer/SDKs/MacOSX10.4u.sdk/usr/include/c++/4.0.0/cmath:547:  
error: template with C linkage
/Developer/SDKs/MacOSX10.4u.sdk/usr/include/c++/4.0.0/cmath:552:  
error: template with C linkage
/Developer/SDKs/MacOSX10.4u.sdk/usr/include/c++/4.0.0/cmath:557:  
error: template with C linkage
/Developer/SDKs/MacOSX10.4u.sdk/usr/include/c++/4.0.0/cmath:562:  
error: template with C linkage
/Developer/SDKs/MacOSX10.4u.sdk/usr/include/c++/4.0.0/cmath:567:  
error: template with C linkage
/Developer/SDKs/MacOSX10.4u.sdk/usr/include/c++/4.0.0/bits/cmath.tcc: 
39: error: template with C linkage
/Developer/SDKs/MacOSX10.4u.sdk/usr/include/c++/4.0.0/complex:55:  
error: template with C linkage
/Developer/SDKs/MacOSX10.4u.sdk/usr/include/c++/4.0.0/complex:61:  
error: template with C linkage
/Developer/SDKs/MacOSX10.4u.sdk/usr/include/c++/4.0.0/complex:63:  
error: template with C linkage
/Developer/SDKs/MacOSX10.4u.sdk/usr/include/c++/4.0.0/complex:65:  
error: template with C linkage
/Developer/SDKs/MacOSX10.4u.sdk/usr/include/c++/4.0.0/complex:68:  
error: template with C linkage
/Developer/SDKs/MacOSX10.4u.sdk/usr/include/c++/4.0.0/complex:70:  
error: template with C linkage
/Developer/SDKs/MacOSX10.4u.sdk/usr/include/c++/4.0.0/complex:74:  
error: template with C linkage
/Developer/SDKs/MacOSX10.4u.sdk/usr/include/c++/4.0.0/complex:76:  
error: template with C linkage
/Developer/SDKs/MacOSX10.4u.sdk/usr/include/c++/4.0.0/complex:78:  
error: template with C linkage
/Developer/SDKs/MacOSX10.4u.sdk/usr/include/c++/4.0.0/complex:80:  
error: template with C linkage
/Developer/SDKs/MacOSX10.4u.sdk/usr/include/c++/4.0.0/complex:82:  
error: template with C linkage
/Developer/SDKs/MacOSX10.4u.sdk/usr/include/c++/4.0.0/complex:84:  
error: template with C linkage
/Developer/SDKs/MacOSX10.4u.sdk/usr/include/c++/4.0.0/complex:86:  
error: template with C linkage
/Developer/SDKs/MacOSX10.4u.sdk/usr/include/c++/4.0.0/complex:89:  
error: template with C linkage
/Developer/SDKs/MacOSX10.4u.sdk/usr/include/c++/4.0.0/complex:91:  
error: template with C linkage
/Developer/SDKs/MacOSX10.4u.sdk/usr/include/c++/4.0.0/complex:93:  
error: template with C linkage
/Developer/SDKs/MacOSX10.4u.sdk/usr/include/c++/4.0.0/complex:95:  
error: template with C linkage
/Developer/SDKs/MacOSX10.4u.sdk/usr/include/c++/4.0.0/complex:97:  
error: template with C linkage
/Developer/SDKs/MacOSX10.4u.sdk/usr/include/c++/4.0.0/complex:99:  
error: template with C linkage
/Developer/SDKs/MacOSX10.4u.sdk/usr/include/c++/4.0.0/complex:101:  
error: template with C linkage
/Developer/SDKs/MacOSX10.4u.sdk/usr/include/c++/4.0.0/complex:128:  
error: template with C linkage
/Developer/SDKs/MacOSX10.4u.sdk/usr/include/c++/4.0.0/complex:155:  
error: template with C linkage
/Developer/SDKs/MacOSX10.4u.sdk/usr/include/c++/4.0.0/complex:158:  
error: template with C linkage
/Developer/SDKs/MacOSX10.4u.sdk/usr/include/c++/4.0.0/complex:161:  
error: template with C linkage
/Developer/SDKs/MacOSX10.4u.sdk/usr/include/c++/4.0.0/complex:164:  
error: template with C linkage
/Developer/SDKs/MacOSX10.4u.sdk/usr/include/c++/4.0.0/complex:167:  
error: template with C linkage
/Developer/SDKs/MacOSX10.4u.sdk/usr/include/c++/4.0.0/complex:55:  
error: template with C linkage
/Developer/SDKs/MacOSX10.4u.sdk/usr/include/c++/4.0.0/complex:61:  
error: template with C linkage
/Developer/SDKs/MacOSX10.4u.sdk/usr/include/c++/4.0.0/complex:63:  
error: template with C linkage
/Developer/SDKs/MacOSX10.4u.sdk/usr/include/c++/4.0.0/complex:65:  
error: template with C linkage
/Developer/SDKs/MacOSX10.4u.sdk/usr/include/c++/4.0.0/complex:318:  
error: template with C linkage
/Developer/SDKs/MacOSX10.4u.sdk/usr/include/c++/4.0.0/complex:68:  
error: template with C linkage
/Developer/SDKs/MacOSX10.4u.sdk/usr/include/c++/4.0.0/complex:70:  
error: template with C linkage
/Developer/SDKs/MacOSX10.4u.sdk/usr/include/c++/4.0.0/complex:74:  
error: template with C linkage/Developer/SDKs/MacOSX10.4u.sdk/usr/ 
include/c++/4.0.0/complex:327: error: template with C linkage

/Developer/SDKs/MacOSX10.4u.sdk/usr/include/c++/4.0.0/complex:76:  
error: template with C linkage
/Developer/SDKs/MacOSX10.4u.sdk/usr/include/c++/4.0.0/complex:336:  
error: template with C linkage/Developer/SDKs/MacOSX10.4u.sdk/usr/ 
include/c++/4.0.0/complex:78: error: template with C linkage

/Developer/SDKs/MacOSX10.4u.sdk/usr/include/c++/4.0.0/complex:80:  
error: template with C linkage
/Developer/SDKs/MacOSX10.4u.sdk/usr/include/c++/4.0.0/complex:348:  
error: template with C linkage
/Developer/SDKs/MacOSX10.4u.sdk/usr/include/c++/4.0.0/complex:357:  
error: template with C linkage
/Developer/SDKs/MacOSX10.4u.sdk/usr/include/c++/4.0.0/complex:82:  
error: template with C linkage
/Developer/SDKs/MacOSX10.4u.sdk/usr/include/c++/4.0.0/complex:366:  
error: template with C linkage/Developer/SDKs/MacOSX10.4u.sdk/usr/ 
include/c++/4.0.0/complex:84: error: template with C linkage

/Developer/SDKs/MacOSX10.4u.sdk/usr/include/c++/4.0.0/complex:86:  
error: template with C linkage
/Developer/SDKs/MacOSX10.4u.sdk/usr/include/c++/4.0.0/complex:378:  
error: template with C linkage/Developer/SDKs/MacOSX10.4u.sdk/usr/ 
include/c++/4.0.0/complex:89: error: template with C linkage

/Developer/SDKs/MacOSX10.4u.sdk/usr/include/c++/4.0.0/complex:91:  
error: template with C linkage
/Developer/SDKs/MacOSX10.4u.sdk/usr/include/c++/4.0.0/complex:93:  
error: template with C linkage
/Developer/SDKs/MacOSX10.4u.sdk/usr/include/c++/4.0.0/complex:387:  
error: template with C linkage
/Developer/SDKs/MacOSX10.4u.sdk/usr/include/c++/4.0.0/complex:95:  
error: template with C linkage
/Developer/SDKs/MacOSX10.4u.sdk/usr/include/c++/4.0.0/complex:396:  
error: template with C linkage/Developer/SDKs/MacOSX10.4u.sdk/usr/ 
include/c++/4.0.0/complex:97: error: template with C linkage

/Developer/SDKs/MacOSX10.4u.sdk/usr/include/c++/4.0.0/complex:99:  
error: template with C linkage
/Developer/SDKs/MacOSX10.4u.sdk/usr/include/c++/4.0.0/complex:101:  
error: template with C linkage
/Developer/SDKs/MacOSX10.4u.sdk/usr/include/c++/4.0.0/complex:408:  
error: template with C linkage
/Developer/SDKs/MacOSX10.4u.sdk/usr/include/c++/4.0.0/complex:417:  
error: template with C linkage
/Developer/SDKs/MacOSX10.4u.sdk/usr/include/c++/4.0.0/complex:128:  
error: template with C linkage
/Developer/SDKs/MacOSX10.4u.sdk/usr/include/c++/4.0.0/complex:426:  
error: template with C linkage
/Developer/SDKs/MacOSX10.4u.sdk/usr/include/c++/4.0.0/complex:437:  
error: template with C linkage
/Developer/SDKs/MacOSX10.4u.sdk/usr/include/c++/4.0.0/complex:443:  
error: template with C linkage
/Developer/SDKs/MacOSX10.4u.sdk/usr/include/c++/4.0.0/complex:155:  
error: template with C linkage
/Developer/SDKs/MacOSX10.4u.sdk/usr/include/c++/4.0.0/complex:158:  
error: template with C linkage
/Developer/SDKs/MacOSX10.4u.sdk/usr/include/c++/4.0.0/complex:161:  
error: template with C linkage
/Developer/SDKs/MacOSX10.4u.sdk/usr/include/c++/4.0.0/complex:164:  
error: template with C linkage
/Developer/SDKs/MacOSX10.4u.sdk/usr/include/c++/4.0.0/complex:450:  
error: template with C linkage
/Developer/SDKs/MacOSX10.4u.sdk/usr/include/c++/4.0.0/complex:167:  
error: template with C linkage
/Developer/SDKs/MacOSX10.4u.sdk/usr/include/c++/4.0.0/complex:455:  
error: template with C linkage
/Developer/SDKs/MacOSX10.4u.sdk/usr/include/c++/4.0.0/complex:460:  
error: template with C linkage
/Developer/SDKs/MacOSX10.4u.sdk/usr/include/c++/4.0.0/complex:468:  
error: template with C linkage
/Developer/SDKs/MacOSX10.4u.sdk/usr/include/c++/4.0.0/complex:473:  
error: template with C linkage
/Developer/SDKs/MacOSX10.4u.sdk/usr/include/c++/4.0.0/complex:478:  
error: template with C linkage
/Developer/SDKs/MacOSX10.4u.sdk/usr/include/c++/4.0.0/complex:485:  
error: template with C linkage
/Developer/SDKs/MacOSX10.4u.sdk/usr/include/c++/4.0.0/complex:518:  
error: template with C linkage
/Developer/SDKs/MacOSX10.4u.sdk/usr/include/c++/4.0.0/complex:531:  
error: template with C linkage
/Developer/SDKs/MacOSX10.4u.sdk/usr/include/c++/4.0.0/complex:536:  
error: template with C linkage
/Developer/SDKs/MacOSX10.4u.sdk/usr/include/c++/4.0.0/complex:541:  
error: template with C linkage
/Developer/SDKs/MacOSX10.4u.sdk/usr/include/c++/4.0.0/complex:546:  
error: template with C linkage
/Developer/SDKs/MacOSX10.4u.sdk/usr/include/c++/4.0.0/complex:318:  
error: template with C linkage
/Developer/SDKs/MacOSX10.4u.sdk/usr/include/c++/4.0.0/complex:552:  
error: template with C linkage
/Developer/SDKs/MacOSX10.4u.sdk/usr/include/c++/4.0.0/complex:327:  
error: template with C linkage
/Developer/SDKs/MacOSX10.4u.sdk/usr/include/c++/4.0.0/complex:336:  
error: template with C linkage
/Developer/SDKs/MacOSX10.4u.sdk/usr/include/c++/4.0.0/complex:348:  
error: template with C linkage
/Developer/SDKs/MacOSX10.4u.sdk/usr/include/c++/4.0.0/complex: In  
function ‘double std::__complex_abs(double __complex__)’:
/Developer/SDKs/MacOSX10.4u.sdk/usr/include/c++/4.0.0/complex:569:  
error: declaration of C function ‘double std::__complex_abs(double  
__complex__)’ conflicts with
/Developer/SDKs/MacOSX10.4u.sdk/usr/include/c++/4.0.0/complex:566:  
error: previous declaration ‘float std::__complex_abs(float  
__complex__)’ here
/Developer/SDKs/MacOSX10.4u.sdk/usr/include/c++/4.0.0/complex:357:  
error: template with C linkage
/Developer/SDKs/MacOSX10.4u.sdk/usr/include/c++/4.0.0/complex: In  
function ‘long double std::__complex_abs(const long double  
__complex__&)’:
/Developer/SDKs/MacOSX10.4u.sdk/usr/include/c++/4.0.0/complex:572:  
error: declaration of C function ‘long double std::__complex_abs(const  
long double __complex__&)’ conflicts with
/Developer/SDKs/MacOSX10.4u.sdk/usr/include/c++/4.0.0/complex:366:  
error: template with C linkage
/Developer/SDKs/MacOSX10.4u.sdk/usr/include/c++/4.0.0/complex:569:  
error: previous declaration ‘double std::__complex_abs(double  
__complex__)’ here
/Developer/SDKs/MacOSX10.4u.sdk/usr/include/c++/4.0.0/complex:378:  
error: template with C linkage
/Developer/SDKs/MacOSX10.4u.sdk/usr/include/c++/4.0.0/complex: At  
global scope:
/Developer/SDKs/MacOSX10.4u.sdk/usr/include/c++/4.0.0/complex:577:  
error: template with C linkage
/Developer/SDKs/MacOSX10.4u.sdk/usr/include/c++/4.0.0/complex:387:  
error: template with C linkage
/Developer/SDKs/MacOSX10.4u.sdk/usr/include/c++/4.0.0/complex:588:  
error: template with C linkage
/Developer/SDKs/MacOSX10.4u.sdk/usr/include/c++/4.0.0/complex:396:  
error: template with C linkage
/Developer/SDKs/MacOSX10.4u.sdk/usr/include/c++/4.0.0/complex: In  
function ‘double std::__complex_arg(double __complex__)’:
/Developer/SDKs/MacOSX10.4u.sdk/usr/include/c++/4.0.0/complex:596:  
error: declaration of C function ‘double std::__complex_arg(double  
__complex__)’ conflicts with
/Developer/SDKs/MacOSX10.4u.sdk/usr/include/c++/4.0.0/complex:593:  
error: previous declaration ‘float std::__complex_arg(float  
__complex__)’ here
/Developer/SDKs/MacOSX10.4u.sdk/usr/include/c++/4.0.0/complex: In  
function ‘long double std::__complex_arg(const long double  
__complex__&)’:
/Developer/SDKs/MacOSX10.4u.sdk/usr/include/c++/4.0.0/complex:599:  
error: declaration of C function ‘long double std::__complex_arg(const  
long double __complex__&)’ conflicts with
/Developer/SDKs/MacOSX10.4u.sdk/usr/include/c++/4.0.0/complex:596:  
error: previous declaration ‘double std::__complex_arg(double  
__complex__)’ here
/Developer/SDKs/MacOSX10.4u.sdk/usr/include/c++/4.0.0/complex:408:  
error: template with C linkage
/Developer/SDKs/MacOSX10.4u.sdk/usr/include/c++/4.0.0/complex: At  
global scope:
/Developer/SDKs/MacOSX10.4u.sdk/usr/include/c++/4.0.0/complex:604:  
error: template with C linkage
/Developer/SDKs/MacOSX10.4u.sdk/usr/include/c++/4.0.0/complex:417:  
error: template with C linkage
/Developer/SDKs/MacOSX10.4u.sdk/usr/include/c++/4.0.0/complex:617:  
error: template with C linkage
/Developer/SDKs/MacOSX10.4u.sdk/usr/include/c++/4.0.0/complex:426:  
error: template with C linkage
/Developer/SDKs/MacOSX10.4u.sdk/usr/include/c++/4.0.0/complex:620:  
error: template with C linkage
/Developer/SDKs/MacOSX10.4u.sdk/usr/include/c++/4.0.0/complex:437:  
error: template with C linkage
/Developer/SDKs/MacOSX10.4u.sdk/usr/include/c++/4.0.0/complex:632:  
error: template with C linkage
/Developer/SDKs/MacOSX10.4u.sdk/usr/include/c++/4.0.0/complex:443:  
error: template with C linkage
/Developer/SDKs/MacOSX10.4u.sdk/usr/include/c++/4.0.0/complex:450:  
error: template with C linkage
/Developer/SDKs/MacOSX10.4u.sdk/usr/include/c++/4.0.0/complex:641:  
error: template with C linkage
/Developer/SDKs/MacOSX10.4u.sdk/usr/include/c++/4.0.0/complex:455:  
error: template with C linkage
/Developer/SDKs/MacOSX10.4u.sdk/usr/include/c++/4.0.0/complex:649:  
error: template with C linkage
/Developer/SDKs/MacOSX10.4u.sdk/usr/include/c++/4.0.0/complex:460:  
error: template with C linkage
/Developer/SDKs/MacOSX10.4u.sdk/usr/include/c++/4.0.0/complex:654:  
error: template with C linkage
/Developer/SDKs/MacOSX10.4u.sdk/usr/include/c++/4.0.0/complex:468:  
error: template with C linkage
/Developer/SDKs/MacOSX10.4u.sdk/usr/include/c++/4.0.0/complex:662:  
error: template with C linkage
/Developer/SDKs/MacOSX10.4u.sdk/usr/include/c++/4.0.0/complex:473:  
error: template with C linkage
/Developer/SDKs/MacOSX10.4u.sdk/usr/include/c++/4.0.0/complex:478:  
error: template with C linkage
/Developer/SDKs/MacOSX10.4u.sdk/usr/include/c++/4.0.0/complex:485:  
error: template with C linkage
/Developer/SDKs/MacOSX10.4u.sdk/usr/include/c++/4.0.0/complex: In  
function ‘double __complex__ std::__complex_cos(double __complex__)’:
/Developer/SDKs/MacOSX10.4u.sdk/usr/include/c++/4.0.0/complex:674:  
error: declaration of C function ‘double __complex__  
std::__complex_cos(double __complex__)’ conflicts with
/Developer/SDKs/MacOSX10.4u.sdk/usr/include/c++/4.0.0/complex:671:  
error: previous declaration ‘float __complex__  
std::__complex_cos(float __complex__)’ here
/Developer/SDKs/MacOSX10.4u.sdk/usr/include/c++/4.0.0/complex: In  
function ‘long double __complex__ std::__complex_cos(const long double  
__complex__&)’:
/Developer/SDKs/MacOSX10.4u.sdk/usr/include/c++/4.0.0/complex:677:  
error: declaration of C function ‘long double __complex__  
std::__complex_cos(const long double __complex__&)’ conflicts with
/Developer/SDKs/MacOSX10.4u.sdk/usr/include/c++/4.0.0/complex:674:  
error: previous declaration ‘double __complex__  
std::__complex_cos(double __complex__)’ here
/Developer/SDKs/MacOSX10.4u.sdk/usr/include/c++/4.0.0/complex:518:  
error: template with C linkage
/Developer/SDKs/MacOSX10.4u.sdk/usr/include/c++/4.0.0/complex: At  
global scope:
/Developer/SDKs/MacOSX10.4u.sdk/usr/include/c++/4.0.0/complex:682:  
error: template with C linkage
/Developer/SDKs/MacOSX10.4u.sdk/usr/include/c++/4.0.0/complex:692:  
error: template with C linkage
/Developer/SDKs/MacOSX10.4u.sdk/usr/include/c++/4.0.0/complex:531:  
error: template with C linkage
/Developer/SDKs/MacOSX10.4u.sdk/usr/include/c++/4.0.0/complex:536:  
error: template with C linkage
/Developer/SDKs/MacOSX10.4u.sdk/usr/include/c++/4.0.0/complex:541:  
error: template with C linkage
/Developer/SDKs/MacOSX10.4u.sdk/usr/include/c++/4.0.0/complex: In  
function ‘double __complex__ std::__complex_cosh(double __complex__)’:
/Developer/SDKs/MacOSX10.4u.sdk/usr/include/c++/4.0.0/complex:704:  
error: declaration of C function ‘double __complex__  
std::__complex_cosh(double __complex__)’ conflicts with
/Developer/SDKs/MacOSX10.4u.sdk/usr/include/c++/4.0.0/complex:701:  
error: previous declaration ‘float __complex__  
std::__complex_cosh(float __complex__)’ here
/Developer/SDKs/MacOSX10.4u.sdk/usr/include/c++/4.0.0/complex:546:  
error: template with C linkage
/Developer/SDKs/MacOSX10.4u.sdk/usr/include/c++/4.0.0/complex: In  
function ‘long double __complex__ std::__complex_cosh(const long  
double __complex__&)’:
/Developer/SDKs/MacOSX10.4u.sdk/usr/include/c++/4.0.0/complex:707:  
error: declaration of C function ‘long double __complex__  
std::__complex_cosh(const long double __complex__&)’ conflicts with
/Developer/SDKs/MacOSX10.4u.sdk/usr/include/c++/4.0.0/complex:704:  
error: previous declaration ‘double __complex__  
std::__complex_cosh(double __complex__)’ here
/Developer/SDKs/MacOSX10.4u.sdk/usr/include/c++/4.0.0/complex: At  
global scope:
/Developer/SDKs/MacOSX10.4u.sdk/usr/include/c++/4.0.0/complex:712:  
error: template with C linkage
/Developer/SDKs/MacOSX10.4u.sdk/usr/include/c++/4.0.0/complex:552:  
error: template with C linkage
/Developer/SDKs/MacOSX10.4u.sdk/usr/include/c++/4.0.0/complex:722:  
error: template with C linkage
/Developer/SDKs/MacOSX10.4u.sdk/usr/include/c++/4.0.0/complex: In  
function ‘double std::__complex_abs(double __complex__)’:
/Developer/SDKs/MacOSX10.4u.sdk/usr/include/c++/4.0.0/complex:569:  
error: declaration of C function ‘double std::__complex_abs(double  
__complex__)’ conflicts with
/Developer/SDKs/MacOSX10.4u.sdk/usr/include/c++/4.0.0/complex:566:  
error: previous declaration ‘float std::__complex_abs(float  
__complex__)’ here
/Developer/SDKs/MacOSX10.4u.sdk/usr/include/c++/4.0.0/complex: In  
function ‘double __complex__ std::__complex_exp(double __complex__)’:
/Developer/SDKs/MacOSX10.4u.sdk/usr/include/c++/4.0.0/complex:730:  
error: declaration of C function ‘double __complex__  
std::__complex_exp(double __complex__)’ conflicts with/Developer/SDKs/ 
MacOSX10.4u.sdk/usr/include/c++/4.0.0/complex: In function ‘long  
double std::__complex_abs(const long double __complex__&)’:
/Developer/SDKs/MacOSX10.4u.sdk/usr/include/c++/4.0.0/complex:572:  
error: declaration of C function ‘long double std::__complex_abs(const  
long double __complex__&)’ conflicts with

/Developer/SDKs/MacOSX10.4u.sdk/usr/include/c++/4.0.0/complex:727:  
error: previous declaration ‘float __complex__  
std::__complex_exp(float __complex__)’ here/Developer/SDKs/ 
MacOSX10.4u.sdk/usr/include/c++/4.0.0/complex:569: error: previous  
declaration ‘double std::__complex_abs(double __complex__)’ here

/Developer/SDKs/MacOSX10.4u.sdk/usr/include/c++/4.0.0/complex: In  
function ‘long double __complex__ std::__complex_exp(const long double  
__complex__&)’:
/Developer/SDKs/MacOSX10.4u.sdk/usr/include/c++/4.0.0/complex:733:  
error: declaration of C function ‘long double __complex__  
std::__complex_exp(const long double __complex__&)’ conflicts with
/Developer/SDKs/MacOSX10.4u.sdk/usr/include/c++/4.0.0/complex: At  
global scope:
/Developer/SDKs/MacOSX10.4u.sdk/usr/include/c++/4.0.0/complex:577:  
error: template with C linkage
/Developer/SDKs/MacOSX10.4u.sdk/usr/include/c++/4.0.0/complex:730:  
error: previous declaration ‘double __complex__  
std::__complex_exp(double __complex__)’ here
/Developer/SDKs/MacOSX10.4u.sdk/usr/include/c++/4.0.0/complex:588:  
error: template with C linkage
/Developer/SDKs/MacOSX10.4u.sdk/usr/include/c++/4.0.0/complex: At  
global scope:
/Developer/SDKs/MacOSX10.4u.sdk/usr/include/c++/4.0.0/complex:738:  
error: template with C linkage
/Developer/SDKs/MacOSX10.4u.sdk/usr/include/c++/4.0.0/complex:749:  
error: template with C linkage
/Developer/SDKs/MacOSX10.4u.sdk/usr/include/c++/4.0.0/complex: In  
function ‘double std::__complex_arg(double __complex__)’:
/Developer/SDKs/MacOSX10.4u.sdk/usr/include/c++/4.0.0/complex:596:  
error: declaration of C function ‘double std::__complex_arg(double  
__complex__)’ conflicts with
/Developer/SDKs/MacOSX10.4u.sdk/usr/include/c++/4.0.0/complex:593:  
error: previous declaration ‘float std::__complex_arg(float  
__complex__)’ here
/Developer/SDKs/MacOSX10.4u.sdk/usr/include/c++/4.0.0/complex:768:  
error: template with C linkage
/Developer/SDKs/MacOSX10.4u.sdk/usr/include/c++/4.0.0/complex: In  
function ‘long double std::__complex_arg(const long double  
__complex__&)’:
/Developer/SDKs/MacOSX10.4u.sdk/usr/include/c++/4.0.0/complex:599:  
error: declaration of C function ‘long double std::__complex_arg(const  
long double __complex__&)’ conflicts with
/Developer/SDKs/MacOSX10.4u.sdk/usr/include/c++/4.0.0/complex:772:  
error: template with C linkage
/Developer/SDKs/MacOSX10.4u.sdk/usr/include/c++/4.0.0/complex:596:  
error: previous declaration ‘double std::__complex_arg(double  
__complex__)’ here
/Developer/SDKs/MacOSX10.4u.sdk/usr/include/c++/4.0.0/complex: At  
global scope:
/Developer/SDKs/MacOSX10.4u.sdk/usr/include/c++/4.0.0/complex:604:  
error: template with C linkage/Developer/SDKs/MacOSX10.4u.sdk/usr/ 
include/c++/4.0.0/complex:778: error: template with C linkage

/Developer/SDKs/MacOSX10.4u.sdk/usr/include/c++/4.0.0/complex:617:  
error: template with C linkage
/Developer/SDKs/MacOSX10.4u.sdk/usr/include/c++/4.0.0/complex:620:  
error: template with C linkage
/Developer/SDKs/MacOSX10.4u.sdk/usr/include/c++/4.0.0/complex:632:  
error: template with C linkage
/Developer/SDKs/MacOSX10.4u.sdk/usr/include/c++/4.0.0/complex:641:  
error: template with C linkage
/Developer/SDKs/MacOSX10.4u.sdk/usr/include/c++/4.0.0/complex: In  
function ‘double __complex__ std::__complex_sin(double __complex__)’:
/Developer/SDKs/MacOSX10.4u.sdk/usr/include/c++/4.0.0/complex:790:  
error: declaration of C function ‘double __complex__  
std::__complex_sin(double __complex__)’ conflicts with
/Developer/SDKs/MacOSX10.4u.sdk/usr/include/c++/4.0.0/complex:649:  
error: template with C linkage
/Developer/SDKs/MacOSX10.4u.sdk/usr/include/c++/4.0.0/complex:787:  
error: previous declaration ‘float __complex__  
std::__complex_sin(float __complex__)’ here
/Developer/SDKs/MacOSX10.4u.sdk/usr/include/c++/4.0.0/complex:654:  
error: template with C linkage
/Developer/SDKs/MacOSX10.4u.sdk/usr/include/c++/4.0.0/complex: In  
function ‘long double __complex__ std::__complex_sin(const long double  
__complex__&)’:
/Developer/SDKs/MacOSX10.4u.sdk/usr/include/c++/4.0.0/complex:793:  
error: declaration of C function ‘long double __complex__  
std::__complex_sin(const long double __complex__&)’ conflicts with
/Developer/SDKs/MacOSX10.4u.sdk/usr/include/c++/4.0.0/complex:790:  
error: previous declaration ‘double __complex__  
std::__complex_sin(double __complex__)’ here
/Developer/SDKs/MacOSX10.4u.sdk/usr/include/c++/4.0.0/complex:662:  
error: template with C linkage
/Developer/SDKs/MacOSX10.4u.sdk/usr/include/c++/4.0.0/complex: At  
global scope:
/Developer/SDKs/MacOSX10.4u.sdk/usr/include/c++/4.0.0/complex:798:  
error: template with C linkage
/Developer/SDKs/MacOSX10.4u.sdk/usr/include/c++/4.0.0/complex:808:  
error: template with C linkage
/Developer/SDKs/MacOSX10.4u.sdk/usr/include/c++/4.0.0/complex: In  
function ‘double __complex__ std::__complex_cos(double __complex__)’:
/Developer/SDKs/MacOSX10.4u.sdk/usr/include/c++/4.0.0/complex:674:  
error: declaration of C function ‘double __complex__  
std::__complex_cos(double __complex__)’ conflicts with
/Developer/SDKs/MacOSX10.4u.sdk/usr/include/c++/4.0.0/complex:671:  
error: previous declaration ‘float __complex__  
std::__complex_cos(float __complex__)’ here
/Developer/SDKs/MacOSX10.4u.sdk/usr/include/c++/4.0.0/complex: In  
function ‘double __complex__ std::__complex_sinh(double __complex__)’:
/Developer/SDKs/MacOSX10.4u.sdk/usr/include/c++/4.0.0/complex:820:  
error: declaration of C function ‘double __complex__  
std::__complex_sinh(double __complex__)’ conflicts with/Developer/SDKs/ 
MacOSX10.4u.sdk/usr/include/c++/4.0.0/complex: In function ‘long  
double __complex__ std::__complex_cos(const long double __complex__&)’:
/Developer/SDKs/MacOSX10.4u.sdk/usr/include/c++/4.0.0/complex:677:  
error: declaration of C function ‘long double __complex__  
std::__complex_cos(const long double __complex__&)’ conflicts with

/Developer/SDKs/MacOSX10.4u.sdk/usr/include/c++/4.0.0/complex:817:  
error: previous declaration ‘float __complex__  
std::__complex_sinh(float __complex__)’ here/Developer/SDKs/ 
MacOSX10.4u.sdk/usr/include/c++/4.0.0/complex:674: error: previous  
declaration ‘double __complex__ std::__complex_cos(double  
__complex__)’ here

/Developer/SDKs/MacOSX10.4u.sdk/usr/include/c++/4.0.0/complex: In  
function ‘long double __complex__ std::__complex_sinh(const long  
double __complex__&)’:
/Developer/SDKs/MacOSX10.4u.sdk/usr/include/c++/4.0.0/complex:823:  
error: declaration of C function ‘long double __complex__  
std::__complex_sinh(const long double __complex__&)’ conflicts with
/Developer/SDKs/MacOSX10.4u.sdk/usr/include/c++/4.0.0/complex: At  
global scope:
/Developer/SDKs/MacOSX10.4u.sdk/usr/include/c++/4.0.0/complex:682:  
error: template with C linkage
/Developer/SDKs/MacOSX10.4u.sdk/usr/include/c++/4.0.0/complex:820:  
error: previous declaration ‘double __complex__  
std::__complex_sinh(double __complex__)’ here
/Developer/SDKs/MacOSX10.4u.sdk/usr/include/c++/4.0.0/complex:692:  
error: template with C linkage
/Developer/SDKs/MacOSX10.4u.sdk/usr/include/c++/4.0.0/complex: At  
global scope:
/Developer/SDKs/MacOSX10.4u.sdk/usr/include/c++/4.0.0/complex:828:  
error: template with C linkage
/Developer/SDKs/MacOSX10.4u.sdk/usr/include/c++/4.0.0/complex:839:  
error: template with C linkage
/Developer/SDKs/MacOSX10.4u.sdk/usr/include/c++/4.0.0/complex: In  
function ‘double __complex__ std::__complex_cosh(double __complex__)’:
/Developer/SDKs/MacOSX10.4u.sdk/usr/include/c++/4.0.0/complex:704:  
error: declaration of C function ‘double __complex__  
std::__complex_cosh(double __complex__)’ conflicts with
/Developer/SDKs/MacOSX10.4u.sdk/usr/include/c++/4.0.0/complex:701:  
error: previous declaration ‘float __complex__  
std::__complex_cosh(float __complex__)’ here
/Developer/SDKs/MacOSX10.4u.sdk/usr/include/c++/4.0.0/complex:707:  
error: declaration of C function ‘long double __complex__  
std::__complex_cosh(const long double __complex__&)’ conflicts with
/Developer/SDKs/MacOSX10.4u.sdk/usr/include/c++/4.0.0/complex:704:  
error: previous declaration ‘double __complex__  
std::__complex_cosh(double __complex__)’ here
/Developer/SDKs/MacOSX10.4u.sdk/usr/include/c++/4.0.0/complex: At  
global scope:
/Developer/SDKs/MacOSX10.4u.sdk/usr/include/c++/4.0.0/complex:712:  
error: template with C linkage
/Developer/SDKs/MacOSX10.4u.sdk/usr/include/c++/4.0.0/complex:722:  
error: template with C linkage
/Developer/SDKs/MacOSX10.4u.sdk/usr/include/c++/4.0.0/complex: In  
function ‘double __complex__ std::__complex_sqrt(double __complex__)’:
/Developer/SDKs/MacOSX10.4u.sdk/usr/include/c++/4.0.0/complex:864:  
error: declaration of C function ‘double __complex__  
std::__complex_sqrt(double __complex__)’ conflicts with
/Developer/SDKs/MacOSX10.4u.sdk/usr/include/c++/4.0.0/complex:861:  
error: previous declaration ‘float __complex__  
std::__complex_sqrt(float __complex__)’ here
/Developer/SDKs/MacOSX10.4u.sdk/usr/include/c++/4.0.0/complex: In  
function ‘double __complex__ std::__complex_exp(double __complex__)’:
/Developer/SDKs/MacOSX10.4u.sdk/usr/include/c++/4.0.0/complex:730:  
error: declaration of C function ‘double __complex__  
std::__complex_exp(double __complex__)’ conflicts with
/Developer/SDKs/MacOSX10.4u.sdk/usr/include/c++/4.0.0/complex:727:  
error: previous declaration ‘float __complex__  
std::__complex_exp(float __complex__)’ here
/Developer/SDKs/MacOSX10.4u.sdk/usr/include/c++/4.0.0/complex: In  
function ‘long double __complex__ std::__complex_sqrt(const long  
double __complex__&)’:
/Developer/SDKs/MacOSX10.4u.sdk/usr/include/c++/4.0.0/complex:867:  
error: declaration of C function ‘long double __complex__  
std::__complex_sqrt(const long double __complex__&)’ conflicts with
/Developer/SDKs/MacOSX10.4u.sdk/usr/include/c++/4.0.0/complex:864:  
error: previous declaration ‘double __complex__  
std::__complex_sqrt(double __complex__)’ here
/Developer/SDKs/MacOSX10.4u.sdk/usr/include/c++/4.0.0/complex: In  
function ‘long double __complex__ std::__complex_exp(const long double  
__complex__&)’:
/Developer/SDKs/MacOSX10.4u.sdk/usr/include/c++/4.0.0/complex:733:  
error: declaration of C function ‘long double __complex__  
std::__complex_exp(const long double __complex__&)’ conflicts with
/Developer/SDKs/MacOSX10.4u.sdk/usr/include/c++/4.0.0/complex:730:  
error: previous declaration ‘double __complex__  
std::__complex_exp(double __complex__)’ here
/Developer/SDKs/MacOSX10.4u.sdk/usr/include/c++/4.0.0/complex: At  
global scope:
/Developer/SDKs/MacOSX10.4u.sdk/usr/include/c++/4.0.0/complex:872:  
error: template with C linkage
/Developer/SDKs/MacOSX10.4u.sdk/usr/include/c++/4.0.0/complex: At  
global scope:
/Developer/SDKs/MacOSX10.4u.sdk/usr/include/c++/4.0.0/complex:738:  
error: template with C linkage
/Developer/SDKs/MacOSX10.4u.sdk/usr/include/c++/4.0.0/complex:883:  
error: template with C linkage
/Developer/SDKs/MacOSX10.4u.sdk/usr/include/c++/4.0.0/complex:749:  
error: template with C linkage
/Developer/SDKs/MacOSX10.4u.sdk/usr/include/c++/4.0.0/complex:768:  
error: template with C linkage
/Developer/SDKs/MacOSX10.4u.sdk/usr/include/c++/4.0.0/complex: In  
function ‘double __complex__ std::__complex_tan(double __complex__)’:
/Developer/SDKs/MacOSX10.4u.sdk/usr/include/c++/4.0.0/complex:891:  
error: declaration of C function ‘double __complex__  
std::__complex_tan(double __complex__)’ conflicts with
/Developer/SDKs/MacOSX10.4u.sdk/usr/include/c++/4.0.0/complex:888:  
error: previous declaration ‘float __complex__  
std::__complex_tan(float __complex__)’ here
/Developer/SDKs/MacOSX10.4u.sdk/usr/include/c++/4.0.0/complex:772:  
error: template with C linkage
/Developer/SDKs/MacOSX10.4u.sdk/usr/include/c++/4.0.0/complex: In  
function ‘long double __complex__ std::__complex_tan(const long double  
__complex__&)’:
/Developer/SDKs/MacOSX10.4u.sdk/usr/include/c++/4.0.0/complex:894:  
error: declaration of C function ‘long double __complex__  
std::__complex_tan(const long double __complex__&)’ conflicts with
/Developer/SDKs/MacOSX10.4u.sdk/usr/include/c++/4.0.0/complex:778:  
error: template with C linkage
/Developer/SDKs/MacOSX10.4u.sdk/usr/include/c++/4.0.0/complex:891:  
error: previous declaration ‘double __complex__  
std::__complex_tan(double __complex__)’ here
/Developer/SDKs/MacOSX10.4u.sdk/usr/include/c++/4.0.0/complex: At  
global scope:
/Developer/SDKs/MacOSX10.4u.sdk/usr/include/c++/4.0.0/complex:899:  
error: template with C linkage
/Developer/SDKs/MacOSX10.4u.sdk/usr/include/c++/4.0.0/complex:911:  
error: template with C linkage
/Developer/SDKs/MacOSX10.4u.sdk/usr/include/c++/4.0.0/complex: In  
function ‘double __complex__ std::__complex_sin(double __complex__)’:
/Developer/SDKs/MacOSX10.4u.sdk/usr/include/c++/4.0.0/complex:790:  
error: declaration of C function ‘double __complex__  
std::__complex_sin(double __complex__)’ conflicts with
/Developer/SDKs/MacOSX10.4u.sdk/usr/include/c++/4.0.0/complex:787:  
error: previous declaration ‘float __complex__  
std::__complex_sin(float __complex__)’ here
/Developer/SDKs/MacOSX10.4u.sdk/usr/include/c++/4.0.0/complex: In  
function ‘long double __complex__ std::__complex_sin(const long double  
__complex__&)’:
/Developer/SDKs/MacOSX10.4u.sdk/usr/include/c++/4.0.0/complex:793:  
error: declaration of C function ‘long double __complex__  
std::__complex_sin(const long double __complex__&)’ conflicts with
/Developer/SDKs/MacOSX10.4u.sdk/usr/include/c++/4.0.0/complex: In  
function ‘double __complex__ std::__complex_tanh(double __complex__)’:
/Developer/SDKs/MacOSX10.4u.sdk/usr/include/c++/4.0.0/complex:919:  
error: declaration of C function ‘double __complex__  
std::__complex_tanh(double __complex__)’ conflicts with
/Developer/SDKs/MacOSX10.4u.sdk/usr/include/c++/4.0.0/complex:790:  
error: previous declaration ‘double __complex__  
std::__complex_sin(double __complex__)’ here
/Developer/SDKs/MacOSX10.4u.sdk/usr/include/c++/4.0.0/complex:916:  
error: previous declaration ‘float __complex__  
std::__complex_tanh(float __complex__)’ here
/Developer/SDKs/MacOSX10.4u.sdk/usr/include/c++/4.0.0/complex: At  
global scope:
/Developer/SDKs/MacOSX10.4u.sdk/usr/include/c++/4.0.0/complex:798:  
error: template with C linkage
/Developer/SDKs/MacOSX10.4u.sdk/usr/include/c++/4.0.0/complex: In  
function ‘long double __complex__ std::__complex_tanh(const long  
double __complex__&)’:
/Developer/SDKs/MacOSX10.4u.sdk/usr/include/c++/4.0.0/complex:922:  
error: declaration of C function ‘long double __complex__  
std::__complex_tanh(const long double __complex__&)’ conflicts with
/Developer/SDKs/MacOSX10.4u.sdk/usr/include/c++/4.0.0/complex:919:  
error: previous declaration ‘double __complex__  
std::__complex_tanh(double __complex__)’ here
/Developer/SDKs/MacOSX10.4u.sdk/usr/include/c++/4.0.0/complex:808:  
error: template with C linkage
/Developer/SDKs/MacOSX10.4u.sdk/usr/include/c++/4.0.0/complex: At  
global scope:
/Developer/SDKs/MacOSX10.4u.sdk/usr/include/c++/4.0.0/complex:927:  
error: template with C linkage
/Developer/SDKs/MacOSX10.4u.sdk/usr/include/c++/4.0.0/complex:940:  
error: template with C linkage
/Developer/SDKs/MacOSX10.4u.sdk/usr/include/c++/4.0.0/complex: In  
function ‘double __complex__ std::__complex_sinh(double __complex__)’:
/Developer/SDKs/MacOSX10.4u.sdk/usr/include/c++/4.0.0/complex:820:  
error: declaration of C function ‘double __complex__  
std::__complex_sinh(double __complex__)’ conflicts with
/Developer/SDKs/MacOSX10.4u.sdk/usr/include/c++/4.0.0/complex:817:  
error: previous declaration ‘float __complex__  
std::__complex_sinh(float __complex__)’ here
/Developer/SDKs/MacOSX10.4u.sdk/usr/include/c++/4.0.0/complex:945:  
error: template with C linkage
/Developer/SDKs/MacOSX10.4u.sdk/usr/include/c++/4.0.0/complex: In  
function ‘long double __complex__ std::__complex_sinh(const long  
double __complex__&)’:
/Developer/SDKs/MacOSX10.4u.sdk/usr/include/c++/4.0.0/complex:823:  
error: declaration of C function ‘long double __complex__  
std::__complex_sinh(const long double __complex__&)’ conflicts with
/Developer/SDKs/MacOSX10.4u.sdk/usr/include/c++/4.0.0/complex:820:  
error: previous declaration ‘double __complex__  
std::__complex_sinh(double __complex__)’ here
/Developer/SDKs/MacOSX10.4u.sdk/usr/include/c++/4.0.0/complex:960:  
error: template with C linkage
/Developer/SDKs/MacOSX10.4u.sdk/usr/include/c++/4.0.0/complex: At  
global scope:
/Developer/SDKs/MacOSX10.4u.sdk/usr/include/c++/4.0.0/complex:828:  
error: template with C linkage
/Developer/SDKs/MacOSX10.4u.sdk/usr/include/c++/4.0.0/complex:839:  
error: template with C linkage
/Developer/SDKs/MacOSX10.4u.sdk/usr/include/c++/4.0.0/complex: In  
function ‘double __complex__ std::__complex_pow(double __complex__,  
double __complex__)’:
/Developer/SDKs/MacOSX10.4u.sdk/usr/include/c++/4.0.0/complex:969:  
error: declaration of C function ‘double __complex__  
std::__complex_pow(double __complex__, double __complex__)’ conflicts  
with
/Developer/SDKs/MacOSX10.4u.sdk/usr/include/c++/4.0.0/complex:965:  
error: previous declaration ‘float __complex__  
std::__complex_pow(float __complex__, float __complex__)’ here
/Developer/SDKs/MacOSX10.4u.sdk/usr/include/c++/4.0.0/complex: In  
function ‘long double __complex__ std::__complex_pow(const long double  
__complex__&, const long double __complex__&)’:
/Developer/SDKs/MacOSX10.4u.sdk/usr/include/c++/4.0.0/complex:974:  
error: declaration of C function ‘long double __complex__  
std::__complex_pow(const long double __complex__&, const long double  
__complex__&)’ conflicts with
/Developer/SDKs/MacOSX10.4u.sdk/usr/include/c++/4.0.0/complex:969:  
error: previous declaration ‘double __complex__  
std::__complex_pow(double __complex__, double __complex__)’ here
/Developer/SDKs/MacOSX10.4u.sdk/usr/include/c++/4.0.0/complex: At  
global scope:
/Developer/SDKs/MacOSX10.4u.sdk/usr/include/c++/4.0.0/complex:979:  
error: template with C linkage
/Developer/SDKs/MacOSX10.4u.sdk/usr/include/c++/4.0.0/complex:990:  
error: template with C linkage
/Developer/SDKs/MacOSX10.4u.sdk/usr/include/c++/4.0.0/complex:1027:  
error: template with C linkage
/Developer/SDKs/MacOSX10.4u.sdk/usr/include/c++/4.0.0/complex:1029:  
error: template with C linkage
/Developer/SDKs/MacOSX10.4u.sdk/usr/include/c++/4.0.0/complex:1031:  
error: template with C linkage
/Developer/SDKs/MacOSX10.4u.sdk/usr/include/c++/4.0.0/complex:1033:  
error: template with C linkage
/Developer/SDKs/MacOSX10.4u.sdk/usr/include/c++/4.0.0/complex:1035:  
error: template with C linkage
/Developer/SDKs/MacOSX10.4u.sdk/usr/include/c++/4.0.0/complex: In  
function ‘double __complex__ std::__complex_sqrt(double __complex__)’:
/Developer/SDKs/MacOSX10.4u.sdk/usr/include/c++/4.0.0/complex:864:  
error: declaration of C function ‘double __complex__  
std::__complex_sqrt(double __complex__)’ conflicts with
/Developer/SDKs/MacOSX10.4u.sdk/usr/include/c++/4.0.0/complex:861:  
error: previous declaration ‘float __complex__  
std::__complex_sqrt(float __complex__)’ here
/Developer/SDKs/MacOSX10.4u.sdk/usr/include/c++/4.0.0/complex: In  
function ‘long double __complex__ std::__complex_sqrt(const long  
double __complex__&)’:
/Developer/SDKs/MacOSX10.4u.sdk/usr/include/c++/4.0.0/complex:867:  
error: declaration of C function ‘long double __complex__  
std::__complex_sqrt(const long double __complex__&)’ conflicts with
/Developer/SDKs/MacOSX10.4u.sdk/usr/include/c++/4.0.0/complex:864:  
error: previous declaration ‘double __complex__  
std::__complex_sqrt(double __complex__)’ here
/Developer/SDKs/MacOSX10.4u.sdk/usr/include/c++/4.0.0/complex: At  
global scope:
/Developer/SDKs/MacOSX10.4u.sdk/usr/include/c++/4.0.0/complex:872:  
error: template with C linkage
/Developer/SDKs/MacOSX10.4u.sdk/usr/include/c++/4.0.0/complex:883:  
error: template with C linkage
/Developer/SDKs/MacOSX10.4u.sdk/usr/include/c++/4.0.0/complex: In  
function ‘double __complex__ std::__complex_tan(double __complex__)’:
/Developer/SDKs/MacOSX10.4u.sdk/usr/include/c++/4.0.0/complex:891:  
error: declaration of C function ‘double __complex__  
std::__complex_tan(double __complex__)’ conflicts with
/Developer/SDKs/MacOSX10.4u.sdk/usr/include/c++/4.0.0/complex:888:  
error: previous declaration ‘float __complex__  
std::__complex_tan(float __complex__)’ here
/Developer/SDKs/MacOSX10.4u.sdk/usr/include/c++/4.0.0/complex: In  
function ‘long double __complex__ std::__complex_tan(const long double  
__complex__&)’:
/Developer/SDKs/MacOSX10.4u.sdk/usr/include/c++/4.0.0/complex:894:  
error: declaration of C function ‘long double __complex__  
std::__complex_tan(const long double __complex__&)’ conflicts with
/Developer/SDKs/MacOSX10.4u.sdk/usr/include/c++/4.0.0/complex:891:  
error: previous declaration ‘double __complex__  
std::__complex_tan(double __complex__)’ here
/Developer/SDKs/MacOSX10.4u.sdk/usr/include/c++/4.0.0/complex: At  
global scope:
/Developer/SDKs/MacOSX10.4u.sdk/usr/include/c++/4.0.0/complex:899:  
error: template with C linkage
/Developer/SDKs/MacOSX10.4u.sdk/usr/include/c++/4.0.0/complex:911:  
error: template with C linkage
/Developer/SDKs/MacOSX10.4u.sdk/usr/include/c++/4.0.0/complex: In  
function ‘double __complex__ std::__complex_tanh(double __complex__)’:
/Developer/SDKs/MacOSX10.4u.sdk/usr/include/c++/4.0.0/complex:919:  
error: declaration of C function ‘double __complex__  
std::__complex_tanh(double __complex__)’ conflicts with
/Developer/SDKs/MacOSX10.4u.sdk/usr/include/c++/4.0.0/complex:916:  
error: previous declaration ‘float __complex__  
std::__complex_tanh(float __complex__)’ here
/Developer/SDKs/MacOSX10.4u.sdk/usr/include/c++/4.0.0/complex: In  
function ‘long double __complex__ std::__complex_tanh(const long  
double __complex__&)’:
/Developer/SDKs/MacOSX10.4u.sdk/usr/include/c++/4.0.0/complex:922:  
error: declaration of C function ‘long double __complex__  
std::__complex_tanh(const long double __complex__&)’ conflicts with
/Developer/SDKs/MacOSX10.4u.sdk/usr/include/c++/4.0.0/complex:919:  
error: previous declaration ‘double __complex__  
std::__complex_tanh(double __complex__)’ here
/Developer/SDKs/MacOSX10.4u.sdk/usr/include/c++/4.0.0/complex: At  
global scope:
/Developer/SDKs/MacOSX10.4u.sdk/usr/include/c++/4.0.0/complex:927:  
error: template with C linkage
/Developer/SDKs/MacOSX10.4u.sdk/usr/include/c++/4.0.0/complex:940:  
error: template with C linkage
/Developer/SDKs/MacOSX10.4u.sdk/usr/include/c++/4.0.0/complex:945:  
error: template with C linkage
/Developer/SDKs/MacOSX10.4u.sdk/usr/include/c++/4.0.0/complex:960:  
error: template with C linkage
/Developer/SDKs/MacOSX10.4u.sdk/usr/include/c++/4.0.0/complex: In  
function ‘double __complex__ std::__complex_pow(double __complex__,  
double __complex__)’:
/Developer/SDKs/MacOSX10.4u.sdk/usr/include/c++/4.0.0/complex:969:  
error: declaration of C function ‘double __complex__  
std::__complex_pow(double __complex__, double __complex__)’ conflicts  
with
/Developer/SDKs/MacOSX10.4u.sdk/usr/include/c++/4.0.0/complex:965:  
error: previous declaration ‘float __complex__  
std::__complex_pow(float __complex__, float __complex__)’ here
/Developer/SDKs/MacOSX10.4u.sdk/usr/include/c++/4.0.0/complex: In  
function ‘long double __complex__ std::__complex_pow(const long double  
__complex__&, const long double __complex__&)’:
/Developer/SDKs/MacOSX10.4u.sdk/usr/include/c++/4.0.0/complex:974:  
error: declaration of C function ‘long double __complex__  
std::__complex_pow(const long double __complex__&, const long double  
__complex__&)’ conflicts with
/Developer/SDKs/MacOSX10.4u.sdk/usr/include/c++/4.0.0/complex:969:  
error: previous declaration ‘double __complex__  
std::__complex_pow(double __complex__, double __complex__)’ here
/Developer/SDKs/MacOSX10.4u.sdk/usr/include/c++/4.0.0/complex: At  
global scope:
/Developer/SDKs/MacOSX10.4u.sdk/usr/include/c++/4.0.0/complex:979:  
error: template with C linkage
/Developer/SDKs/MacOSX10.4u.sdk/usr/include/c++/4.0.0/complex:990:  
error: template with C linkage
/Developer/SDKs/MacOSX10.4u.sdk/usr/include/c++/4.0.0/complex:1180:  
error: template with C linkage
/Developer/SDKs/MacOSX10.4u.sdk/usr/include/c++/4.0.0/complex:1182:  
error: template with C linkage
/Developer/SDKs/MacOSX10.4u.sdk/usr/include/c++/4.0.0/complex:1184:  
error: template with C linkage
/Developer/SDKs/MacOSX10.4u.sdk/usr/include/c++/4.0.0/complex:1027:  
error: template with C linkage
/Developer/SDKs/MacOSX10.4u.sdk/usr/include/c++/4.0.0/complex:1186:  
error: template with C linkage
/Developer/SDKs/MacOSX10.4u.sdk/usr/include/c++/4.0.0/complex:1029:  
error: template with C linkage
/Developer/SDKs/MacOSX10.4u.sdk/usr/include/c++/4.0.0/complex:1188:  
error: template with C linkage
/Developer/SDKs/MacOSX10.4u.sdk/usr/include/c++/4.0.0/complex:1031:  
error: template with C linkage
/Developer/SDKs/MacOSX10.4u.sdk/usr/include/c++/4.0.0/complex:1033:  
error: template with C linkage
/Developer/SDKs/MacOSX10.4u.sdk/usr/include/c++/4.0.0/complex:1035:  
error: template with C linkage
/Developer/SDKs/MacOSX10.4u.sdk/usr/include/c++/4.0.0/complex:1333:  
error: template with C linkage
/Developer/SDKs/MacOSX10.4u.sdk/usr/include/c++/4.0.0/complex:1335:  
error: template with C linkage
/Developer/SDKs/MacOSX10.4u.sdk/usr/include/c++/4.0.0/complex:1337:  
error: template with C linkage
/Developer/SDKs/MacOSX10.4u.sdk/usr/include/c++/4.0.0/complex:1339:  
error: template with C linkage
/Developer/SDKs/MacOSX10.4u.sdk/usr/include/c++/4.0.0/complex:1341:  
error: template with C linkage
/Developer/SDKs/MacOSX10.4u.sdk/usr/include/c++/4.0.0/complex:1180:  
error: template with C linkage
/Developer/SDKs/MacOSX10.4u.sdk/usr/include/c++/4.0.0/complex:1182:  
error: template with C linkage
/Developer/SDKs/MacOSX10.4u.sdk/usr/include/c++/4.0.0/complex:1184:  
error: template with C linkage
/Developer/SDKs/MacOSX10.4u.sdk/usr/include/c++/4.0.0/complex:1186:  
error: template with C linkage
/Developer/SDKs/MacOSX10.4u.sdk/usr/include/c++/4.0.0/complex:1188:  
error: template with C linkage
/Developer/SDKs/MacOSX10.4u.sdk/usr/include/c++/4.0.0/complex:1333:  
error: template with C linkage
/Developer/SDKs/MacOSX10.4u.sdk/usr/include/c++/4.0.0/complex:1335:  
error: template with C linkage
/Developer/SDKs/MacOSX10.4u.sdk/usr/include/c++/4.0.0/complex:1337:  
error: template with C linkage
/Developer/SDKs/MacOSX10.4u.sdk/usr/include/c++/4.0.0/complex:1339:  
error: template with C linkage
/Developer/SDKs/MacOSX10.4u.sdk/usr/include/c++/4.0.0/complex:1341:  
error: template with C linkage
lipo: can't figure out the architecture type of: /var/folders/jz/ 
jzMQLnV-GOWCP55tPgPBl++++Tc/-Tmp-//cccQ8EWC.out
In file included from /Developer/SDKs/MacOSX10.4u.sdk/usr/include/c++/ 
4.0.0/backward/complex.h:31,
                  from /Library/Frameworks/Python.framework/Versions/ 
2.5/lib/python2.5/site-packages/numpy/core/include/numpy/npy_common.h: 
101,
                  from /Library/Frameworks/Python.framework/Versions/ 
2.5/lib/python2.5/site-packages/numpy/core/include/numpy/ 
ndarrayobject.h:68,
                  from /Library/Frameworks/Python.framework/Versions/ 
2.5/lib/python2.5/site-packages/numpy/core/include/numpy/arrayobject.h: 
14,
                  from scipy/interpolate/src/_interpolate.cpp:5:
/Developer/SDKs/MacOSX10.4u.sdk/usr/include/c++/4.0.0/backward/ 
backward_warning.h:32:2: warning: #warning This file includes at least  
one deprecated or antiquateIn file included from /Developer/SDKs/ 
MacOSX10.4u.sdk/usr/include/c++/4.0.0/backward/complex.h:31d,
                  from /Library/Frameworks/Python.framework/Versions/ 
2.5/lib/python2.5/site-packages/numpy/core/include/numpy/npy_common.h: 
101 h,
                  from /Library/Frameworks/Python.framework/Versions/ 
2.5/lib/python2.5/site-packages/numpy/core/include/numpy/ 
ndarrayobject.h:68ea,
                  from /Library/Frameworks/Python.framework/Versions/ 
2.5/lib/python2.5/site-packages/numpy/core/include/numpy/arrayobject.h: 
14de,
                  from scipy/interpolate/src/_interpolate.cpp:5r:
./Developer/SDKs/MacOSX10.4u.sdk/usr/include/c++/4.0.0/backward/ 
backward_warning.h:32:2:  Pleawarning: #warning Thiss fiele c  
oinnscilduedre using one of s at lethe 32 headersast  onef oundepd in  
section 17.4.1.2 orecf the C++ stateandd or antiquatedard. Examples   
hinecadleurd.e Pleas seu bcsotnitsuitdienrg u stihne g< Xo> header for  
ne tofh et <hXe 32 headers. found in section 17.4.1.2h o>f  thhee aCd+e 
+r  sftoarn dCa+rd+.  iEnxcalmpuldeess ,i nocrl u<dei suobstituting  
thstree <X> aheadmer>  fori nsttheea d<X .ohf>  htehea ddeer pfroerca  
tCe+d+  ihnecaldeurd es, <or io<iosstreatrema.mh>. To disabl>e   
tihnsitse awdarn ionfg t huese  d-epWrneo-decaprecatedt.
ed header <iostream.h>. To disable this warning use -Wno-deprecated.
/Developer/SDKs/MacOSX10.4u.sdk/usr/include/c++/4.0.0/cmath:85: error:  
template with C linkage
/Developer/SDKs/MacOSX10.4u.sdk/usr/include/c++/4.0.0/cmath: In  
function ‘float std::abs(float)’:
/Developer/SDKs/MacOSX10.4u.sdk/usr/include/c++/4.0.0/cmath:92: error:  
declaration of C function ‘float std::abs(float)’ conflicts with
/Developer/SDKs/MacOSX10.4u.sdk/usr/include/c++/4.0.0/cmath:88: error:  
previous declaration ‘double std::abs(double)’ here
/Developer/SDKs/MacOSX10.4u.sdk/usr/include/c++/4.0.0/cmath: In  
function ‘long double std::abs(long double)’:
/Developer/SDKs/MacOSX10.4u.sdk/usr/include/c++/4.0.0/cmath:96: error:  
declaration of C function ‘long double std::abs(long double)’  
conflicts with
/Developer/SDKs/MacOSX10.4u.sdk/usr/include/c++/4.0.0/cmath:92: error:  
previous declaration ‘float std::abs(float)’ here
/Developer/SDKs/MacOSX10.4u.sdk/usr/include/c++/4.0.0/cmath: In  
function ‘long double std::acos(long double)’:
/Developer/SDKs/MacOSX10.4u.sdk/usr/include/c++/4.0.0/cmath:106:  
error: declaration of C function ‘long double std::acos(long double)’  
conflicts with
/Developer/SDKs/MacOSX10.4u.sdk/usr/include/c++/4.0.0/cmath:102:  
error: previous declaration ‘float std::acos(float)’ here
/Developer/SDKs/MacOSX10.4u.sdk/usr/include/c++/4.0.0/cmath: At global  
scope:
/Developer/SDKs/MacOSX10.4u.sdk/usr/include/c++/4.0.0/cmath:111:  
error: template with C linkage
/Developer/SDKs/MacOSX10.4u.sdk/usr/include/c++/4.0.0/cmath: In  
function ‘long double std::asin(long double)’:
/Developer/SDKs/MacOSX10.4u.sdk/usr/include/c++/4.0.0/cmath:123:  
error: declaration of C function ‘long double std::asin(long double)’  
conflicts with
/Developer/SDKs/MacOSX10.4u.sdk/usr/include/c++/4.0.0/cmath:119:  
error: previous declaration ‘float std::asin(float)’ here
/Developer/SDKs/MacOSX10.4u.sdk/usr/include/c++/4.0.0/cmath: At global  
scope:
/Developer/SDKs/MacOSX10.4u.sdk/usr/include/c++/4.0.0/cmath:128:  
error: template with C linkage
/Developer/SDKs/MacOSX10.4u.sdk/usr/include/c++/4.0.0/cmath: In  
function ‘long double std::atan(long double)’:
/Developer/SDKs/MacOSX10.4u.sdk/usr/include/c++/4.0.0/cmath:138:  
error: declaration of C function ‘long double std::atan(long double)’  
conflicts with
/Developer/SDKs/MacOSX10.4u.sdk/usr/include/c++/4.0.0/cmath:134:  
error: previous declaration ‘float std::atan(float)’ here
/Developer/SDKs/MacOSX10.4u.sdk/usr/include/c++/4.0.0/cmath: At global  
scope:
/Developer/SDKs/MacOSX10.4u.sdk/usr/include/c++/4.0.0/cmath:143:  
error: template with C linkage
/Developer/SDKs/MacOSX10.4u.sdk/usr/include/c++/4.0.0/cmath: In  
function ‘long double std::atan2(long double, long double)’:
/Developer/SDKs/MacOSX10.4u.sdk/usr/include/c++/4.0.0/cmath:153:  
error: declaration of C function ‘long double std::atan2(long double,  
long double)’ conflicts with
/Developer/SDKs/MacOSX10.4u.sdk/usr/include/c++/4.0.0/cmath:149:  
error: previous declaration ‘float std::atan2(float, float)’ here
/Developer/SDKs/MacOSX10.4u.sdk/usr/include/c++/4.0.0/cmath: At global  
scope:
/Developer/SDKs/MacOSX10.4u.sdk/usr/include/c++/4.0.0/cmath:159:  
error: template with C linkage
/Developer/SDKs/MacOSX10.4u.sdk/usr/include/c++/4.0.0/cmath: In  
function ‘long double std::ceil(long double)’:
/Developer/SDKs/MacOSX10.4u.sdk/usr/include/c++/4.0.0/cmath:169:  
error: declaration of C function ‘long double std::ceil(long double)’  
conflicts with
/Developer/SDKs/MacOSX10.4u.sdk/usr/include/c++/4.0.0/cmath:165:  
error: previous declaration ‘float std::ceil(float)’ here
/Developer/SDKs/MacOSX10.4u.sdk/usr/include/c++/4.0.0/cmath: At global  
scope:
/Developer/SDKs/MacOSX10.4u.sdk/usr/include/c++/4.0.0/cmath:174:  
error: template with C linkage
/Developer/SDKs/MacOSX10.4u.sdk/usr/include/c++/4.0.0/cmath: In  
function ‘long double std::cos(long double)’:
/Developer/SDKs/MacOSX10.4u.sdk/usr/include/c++/4.0.0/cmath:184:  
error: declaration of C function ‘long double std::cos(long double)’  
conflicts with
/Developer/SDKs/MacOSX10.4u.sdk/usr/include/c++/4.0.0/cmath:180:  
error: previous declaration ‘float std::cos(float)’ here
/Developer/SDKs/MacOSX10.4u.sdk/usr/include/c++/4.0.0/cmath: At global  
scope:
/Developer/SDKs/MacOSX10.4u.sdk/usr/include/c++/4.0.0/cmath:189:  
error: template with C linkage
/Developer/SDKs/MacOSX10.4u.sdk/usr/include/c++/4.0.0/cmath:85: error:  
template with C linkage
/Developer/SDKs/MacOSX10.4u.sdk/usr/include/c++/4.0.0/cmath: In  
function ‘float std::abs(float)’:
/Developer/SDKs/MacOSX10.4u.sdk/usr/include/c++/4.0.0/cmath:92: error:  
declaration of C function ‘float std::abs(float)’ conflicts with
/Developer/SDKs/MacOSX10.4u.sdk/usr/include/c++/4.0.0/cmath:88: error:  
previous declaration ‘double std::abs(double)’ here
/Developer/SDKs/MacOSX10.4u.sdk/usr/include/c++/4.0.0/cmath: In  
function ‘long double std::abs(long double)’:
/Developer/SDKs/MacOSX10.4u.sdk/usr/include/c++/4.0.0/cmath:96: error:  
declaration of C function ‘long double std::abs(long double)’  
conflicts with
/Developer/SDKs/MacOSX10.4u.sdk/usr/include/c++/4.0.0/cmath:92: error:  
previous declaration ‘float std::abs(float)’ here
/Developer/SDKs/MacOSX10.4u.sdk/usr/include/c++/4.0.0/cmath: In  
function ‘long double std::acos(long double)’:
/Developer/SDKs/MacOSX10.4u.sdk/usr/include/c++/4.0.0/cmath:106:  
error: declaration of C function ‘long double std::acos(long double)’  
conflicts with
/Developer/SDKs/MacOSX10.4u.sdk/usr/include/c++/4.0.0/cmath: In  
function ‘long double std::cosh(long double)’:
/Developer/SDKs/MacOSX10.4u.sdk/usr/include/c++/4.0.0/cmath:199:  
error: declaration of C function ‘long double std::cosh(long double)’  
conflicts with
/Developer/SDKs/MacOSX10.4u.sdk/usr/include/c++/4.0.0/cmath:195:  
error: previous declaration ‘float std::cosh(float)’ here
/Developer/SDKs/MacOSX10.4u.sdk/usr/include/c++/4.0.0/cmath:102:  
error: previous declaration ‘float std::acos(float)’ here
/Developer/SDKs/MacOSX10.4u.sdk/usr/include/c++/4.0.0/cmath: At global  
scope:
/Developer/SDKs/MacOSX10.4u.sdk/usr/include/c++/4.0.0/cmath:204:  
error: template with C linkage
/Developer/SDKs/MacOSX10.4u.sdk/usr/include/c++/4.0.0/cmath: At global  
scope:
/Developer/SDKs/MacOSX10.4u.sdk/usr/include/c++/4.0.0/cmath:111:  
error: template with C linkage
/Developer/SDKs/MacOSX10.4u.sdk/usr/include/c++/4.0.0/cmath: In  
function ‘long double std::asin(long double)’:
/Developer/SDKs/MacOSX10.4u.sdk/usr/include/c++/4.0.0/cmath:123:  
error: declaration of C function ‘long double std::asin(long double)’  
conflicts with
/Developer/SDKs/MacOSX10.4u.sdk/usr/include/c++/4.0.0/cmath:119:  
error: previous declaration ‘float std::asin(float)’ here
/Developer/SDKs/MacOSX10.4u.sdk/usr/include/c++/4.0.0/cmath: In  
function ‘long double std::exp(long double)’:
/Developer/SDKs/MacOSX10.4u.sdk/usr/include/c++/4.0.0/cmath:214:  
error: declaration of C function ‘long double std::exp(long double)’  
conflicts with
/Developer/SDKs/MacOSX10.4u.sdk/usr/include/c++/4.0.0/cmath:210:  
error: previous declaration ‘float std::exp(float)’ here
/Developer/SDKs/MacOSX10.4u.sdk/usr/include/c++/4.0.0/cmath: At global  
scope:
/Developer/SDKs/MacOSX10.4u.sdk/usr/include/c++/4.0.0/cmath:128:  
error: template with C linkage
/Developer/SDKs/MacOSX10.4u.sdk/usr/include/c++/4.0.0/cmath: At global  
scope:
/Developer/SDKs/MacOSX10.4u.sdk/usr/include/c++/4.0.0/cmath:219:  
error: template with C linkage
/Developer/SDKs/MacOSX10.4u.sdk/usr/include/c++/4.0.0/cmath: In  
function ‘long double std::atan(long double)’:
/Developer/SDKs/MacOSX10.4u.sdk/usr/include/c++/4.0.0/cmath:138:  
error: declaration of C function ‘long double std::atan(long double)’  
conflicts with
/Developer/SDKs/MacOSX10.4u.sdk/usr/include/c++/4.0.0/cmath:134:  
error: previous declaration ‘float std::atan(float)’ here
/Developer/SDKs/MacOSX10.4u.sdk/usr/include/c++/4.0.0/cmath: At global  
scope:
/Developer/SDKs/MacOSX10.4u.sdk/usr/include/c++/4.0.0/cmath:143:  
error: template with C linkage
/Developer/SDKs/MacOSX10.4u.sdk/usr/include/c++/4.0.0/cmath: In  
function ‘long double std::fabs(long double)’:
/Developer/SDKs/MacOSX10.4u.sdk/usr/include/c++/4.0.0/cmath:229:  
error: declaration of C function ‘long double std::fabs(long double)’  
conflicts with
/Developer/SDKs/MacOSX10.4u.sdk/usr/include/c++/4.0.0/cmath:225:  
error: previous declaration ‘float std::fabs(float)’ here
/Developer/SDKs/MacOSX10.4u.sdk/usr/include/c++/4.0.0/cmath: In  
function ‘long double std::atan2(long double, long double)’:
/Developer/SDKs/MacOSX10.4u.sdk/usr/include/c++/4.0.0/cmath:153:  
error: declaration of C function ‘long double std::atan2(long double,  
long double)’ conflicts with
/Developer/SDKs/MacOSX10.4u.sdk/usr/include/c++/4.0.0/cmath:149:  
error: previous declaration ‘float std::atan2(float, float)’ here
/Developer/SDKs/MacOSX10.4u.sdk/usr/include/c++/4.0.0/cmath: At global  
scope:
/Developer/SDKs/MacOSX10.4u.sdk/usr/include/c++/4.0.0/cmath:159:  
error: template with C linkage
/Developer/SDKs/MacOSX10.4u.sdk/usr/include/c++/4.0.0/cmath: At global  
scope:
/Developer/SDKs/MacOSX10.4u.sdk/usr/include/c++/4.0.0/cmath:234:  
error: template with C linkage
/Developer/SDKs/MacOSX10.4u.sdk/usr/include/c++/4.0.0/cmath: In  
function ‘long double std::ceil(long double)’:
/Developer/SDKs/MacOSX10.4u.sdk/usr/include/c++/4.0.0/cmath:169:  
error: declaration of C function ‘long double std::ceil(long double)’  
conflicts with
/Developer/SDKs/MacOSX10.4u.sdk/usr/include/c++/4.0.0/cmath:165:  
error: previous declaration ‘float std::ceil(float)’ here
/Developer/SDKs/MacOSX10.4u.sdk/usr/include/c++/4.0.0/cmath: At global  
scope:
/Developer/SDKs/MacOSX10.4u.sdk/usr/include/c++/4.0.0/cmath:174:  
error: template with C linkage
/Developer/SDKs/MacOSX10.4u.sdk/usr/include/c++/4.0.0/cmath: In  
function ‘long double std::floor(long double)’:
/Developer/SDKs/MacOSX10.4u.sdk/usr/include/c++/4.0.0/cmath:244:  
error: declaration of C function ‘long double std::floor(long double)’  
conflicts with
/Developer/SDKs/MacOSX10.4u.sdk/usr/include/c++/4.0.0/cmath:240:  
error: previous declaration ‘float std::floor(float)’ here
/Developer/SDKs/MacOSX10.4u.sdk/usr/include/c++/4.0.0/cmath: In  
function ‘long double std::cos(long double)’:
/Developer/SDKs/MacOSX10.4u.sdk/usr/include/c++/4.0.0/cmath:184:  
error: declaration of C function ‘long double std::cos(long double)’  
conflicts with
/Developer/SDKs/MacOSX10.4u.sdk/usr/include/c++/4.0.0/cmath:180:  
error: previous declaration ‘float std::cos(float)’ here
/Developer/SDKs/MacOSX10.4u.sdk/usr/include/c++/4.0.0/cmath: At global  
scope:
/Developer/SDKs/MacOSX10.4u.sdk/usr/include/c++/4.0.0/cmath:249:  
error: template with C linkage
/Developer/SDKs/MacOSX10.4u.sdk/usr/include/c++/4.0.0/cmath: At global  
scope:
/Developer/SDKs/MacOSX10.4u.sdk/usr/include/c++/4.0.0/cmath:189:  
error: template with C linkage
/Developer/SDKs/MacOSX10.4u.sdk/usr/include/c++/4.0.0/cmath: In  
function ‘long double std::fmod(long double, long double)’:
/Developer/SDKs/MacOSX10.4u.sdk/usr/include/c++/4.0.0/cmath:259:  
error: declaration of C function ‘long double std::fmod(long double,  
long double)’ conflicts with
/Developer/SDKs/MacOSX10.4u.sdk/usr/include/c++/4.0.0/cmath: In  
function ‘long double std::cosh(long double)’:
/Developer/SDKs/MacOSX10.4u.sdk/usr/include/c++/4.0.0/cmath:199:  
error: declaration of C function ‘long double std::cosh(long double)’  
conflicts with
/Developer/SDKs/MacOSX10.4u.sdk/usr/include/c++/4.0.0/cmath:255:  
error: previous declaration ‘float std::fmod(float, float)’ here
/Developer/SDKs/MacOSX10.4u.sdk/usr/include/c++/4.0.0/cmath:195:  
error: previous declaration ‘float std::cosh(float)’ here
/Developer/SDKs/MacOSX10.4u.sdk/usr/include/c++/4.0.0/cmath: At global  
scope:
/Developer/SDKs/MacOSX10.4u.sdk/usr/include/c++/4.0.0/cmath:204:  
error: template with C linkage
/Developer/SDKs/MacOSX10.4u.sdk/usr/include/c++/4.0.0/cmath: In  
function ‘long double std::frexp(long double, int*)’:
/Developer/SDKs/MacOSX10.4u.sdk/usr/include/c++/4.0.0/cmath:269:  
error: declaration of C function ‘long double std::frexp(long double,  
int*)’ conflicts with
/Developer/SDKs/MacOSX10.4u.sdk/usr/include/c++/4.0.0/cmath:265:  
error: previous declaration ‘float std::frexp(float, int*)’ here
/Developer/SDKs/MacOSX10.4u.sdk/usr/include/c++/4.0.0/cmath: In  
function ‘long double std::exp(long double)’:
/Developer/SDKs/MacOSX10.4u.sdk/usr/include/c++/4.0.0/cmath:214:  
error: declaration of C function ‘long double std::exp(long double)’  
conflicts with
/Developer/SDKs/MacOSX10.4u.sdk/usr/include/c++/4.0.0/cmath:210:  
error: previous declaration ‘float std::exp(float)’ here
/Developer/SDKs/MacOSX10.4u.sdk/usr/include/c++/4.0.0/cmath: At global  
scope:
/Developer/SDKs/MacOSX10.4u.sdk/usr/include/c++/4.0.0/cmath:274:  
error: template with C linkage
/Developer/SDKs/MacOSX10.4u.sdk/usr/include/c++/4.0.0/cmath: At global  
scope:
/Developer/SDKs/MacOSX10.4u.sdk/usr/include/c++/4.0.0/cmath:219:  
error: template with C linkage
/Developer/SDKs/MacOSX10.4u.sdk/usr/include/c++/4.0.0/cmath: In  
function ‘long double std::ldexp(long double, int)’:
/Developer/SDKs/MacOSX10.4u.sdk/usr/include/c++/4.0.0/cmath:284:  
error: declaration of C function ‘long double std::ldexp(long double,  
int)’ conflicts with
/Developer/SDKs/MacOSX10.4u.sdk/usr/include/c++/4.0.0/cmath:280:  
error: previous declaration ‘float std::ldexp(float, int)’ here/ 
Developer/SDKs/MacOSX10.4u.sdk/usr/include/c++/4.0.0/cmath: In  
function ‘long double std::fabs(long double)’:
/Developer/SDKs/MacOSX10.4u.sdk/usr/include/c++/4.0.0/cmath:229:  
error: declaration of C function ‘long double std::fabs(long double)’  
conflicts with
/Developer/SDKs/MacOSX10.4u.sdk/usr/include/c++/4.0.0/cmath:225:  
error: previous declaration ‘float std::fabs(float)’ here
/Developer/SDKs/MacOSX10.4u.sdk/usr/include/c++/4.0.0/cmath: At global  
scope:
/Developer/SDKs/MacOSX10.4u.sdk/usr/include/c++/4.0.0/cmath:234:  
error: template with C linkage
/Developer/SDKs/MacOSX10.4u.sdk/usr/include/c++/4.0.0/cmath: In  
function ‘long double std::floor(long double)’:
/Developer/SDKs/MacOSX10.4u.sdk/usr/include/c++/4.0.0/cmath:244:  
error: declaration of C function ‘long double std::floor(long double)’  
conflicts with
/Developer/SDKs/MacOSX10.4u.sdk/usr/include/c++/4.0.0/cmath:240:  
error: previous declaration ‘float std::floor(float)’ here
/Developer/SDKs/MacOSX10.4u.sdk/usr/include/c++/4.0.0/cmath: At global  
scope:
/Developer/SDKs/MacOSX10.4u.sdk/usr/include/c++/4.0.0/cmath:249:  
error: template with C linkage
/Developer/SDKs/MacOSX10.4u.sdk/usr/include/c++/4.0.0/cmath: In  
function ‘long double std::fmod(long double, long double)’:
/Developer/SDKs/MacOSX10.4u.sdk/usr/include/c++/4.0.0/cmath:259:  
error: declaration of C function ‘long double std::fmod(long double,  
long double)’ conflicts with
/Developer/SDKs/MacOSX10.4u.sdk/usr/include/c++/4.0.0/cmath:255:  
error: previous declaration ‘float std::fmod(float, float)’ here
/Developer/SDKs/MacOSX10.4u.sdk/usr/include/c++/4.0.0/cmath: In  
function ‘long double std::frexp(long double, int*)’:
/Developer/SDKs/MacOSX10.4u.sdk/usr/include/c++/4.0.0/cmath:269:  
error: declaration of C function ‘long double std::frexp(long double,  
int*)’ conflicts with
/Developer/SDKs/MacOSX10.4u.sdk/usr/include/c++/4.0.0/cmath:265:  
error: previous declaration ‘float std::frexp(float, int*)’ here
/Developer/SDKs/MacOSX10.4u.sdk/usr/include/c++/4.0.0/cmath: At global  
scope:
/Developer/SDKs/MacOSX10.4u.sdk/usr/include/c++/4.0.0/cmath:274:  
error: template with C linkage
/Developer/SDKs/MacOSX10.4u.sdk/usr/include/c++/4.0.0/cmath: In  
function ‘long double std::ldexp(long double, int)’:
/Developer/SDKs/MacOSX10.4u.sdk/usr/include/c++/4.0.0/cmath:284:  
error: declaration of C function ‘long double std::ldexp(long double,  
int)’ conflicts with
/Developer/SDKs/MacOSX10.4u.sdk/usr/include/c++/4.0.0/cmath:280:  
error: previous declaration ‘float std::ldexp(float, int)’ here
/Developer/SDKs/MacOSX10.4u.sdk/usr/include/c++/4.0.0/cmath: At global  
scope:
/Developer/SDKs/MacOSX10.4u.sdk/usr/include/c++/4.0.0/cmath:289:  
error: template with C linkage
/Developer/SDKs/MacOSX10.4u.sdk/usr/include/c++/4.0.0/cmath: In  
function ‘long double std::log(long double)’:
/Developer/SDKs/MacOSX10.4u.sdk/usr/include/c++/4.0.0/cmath:299:  
error: declaration of C function ‘long double std::log(long double)’  
conflicts with
/Developer/SDKs/MacOSX10.4u.sdk/usr/include/c++/4.0.0/cmath:295:  
error: previous declaration ‘float std::log(float)’ here

/Developer/SDKs/MacOSX10.4u.sdk/usr/include/c++/4.0.0/cmath: At global  
scope:
/Developer/SDKs/MacOSX10.4u.sdk/usr/include/c++/4.0.0/cmath:304:  
error: template with C linkage
/Developer/SDKs/MacOSX10.4u.sdk/usr/include/c++/4.0.0/cmath: In  
function ‘long double std::log10(long double)’:
/Developer/SDKs/MacOSX10.4u.sdk/usr/include/c++/4.0.0/cmath:314:  
error: declaration of C function ‘long double std::log10(long double)’  
conflicts with
/Developer/SDKs/MacOSX10.4u.sdk/usr/include/c++/4.0.0/cmath:310:  
error: previous declaration ‘float std::log10(float)’ here
/Developer/SDKs/MacOSX10.4u.sdk/usr/include/c++/4.0.0/cmath: At global  
scope:
/Developer/SDKs/MacOSX10.4u.sdk/usr/include/c++/4.0.0/cmath:319:  
error: template with C linkage
/Developer/SDKs/MacOSX10.4u.sdk/usr/include/c++/4.0.0/cmath: At global  
scope:
/Developer/SDKs/MacOSX10.4u.sdk/usr/include/c++/4.0.0/cmath:289:  
error: template with C linkage
/Developer/SDKs/MacOSX10.4u.sdk/usr/include/c++/4.0.0/cmath: In  
function ‘long double std::modf(long double, long double*)’:
/Developer/SDKs/MacOSX10.4u.sdk/usr/include/c++/4.0.0/cmath:329:  
error: declaration of C function ‘long double std::modf(long double,  
long double*)’ conflicts with
/Developer/SDKs/MacOSX10.4u.sdk/usr/include/c++/4.0.0/cmath:325:  
error: previous declaration ‘float std::modf(float, float*)’ here
/Developer/SDKs/MacOSX10.4u.sdk/usr/include/c++/4.0.0/cmath: At global  
scope:
/Developer/SDKs/MacOSX10.4u.sdk/usr/include/c++/4.0.0/cmath:334:  
error: template with C linkage
/Developer/SDKs/MacOSX10.4u.sdk/usr/include/c++/4.0.0/cmath: In  
function ‘long double std::pow(long double, long double)’:
/Developer/SDKs/MacOSX10.4u.sdk/usr/include/c++/4.0.0/cmath:348:  
error: declaration of C function ‘long double std::pow(long double,  
long double)’ conflicts with
/Developer/SDKs/MacOSX10.4u.sdk/usr/include/c++/4.0.0/cmath:344:  
error: previous declaration ‘float std::pow(float, float)’ here
/Developer/SDKs/MacOSX10.4u.sdk/usr/include/c++/4.0.0/cmath:352:  
error: declaration of C function ‘double std::pow(double, int)’  
conflicts with
/Developer/SDKs/MacOSX10.4u.sdk/usr/include/c++/4.0.0/cmath:348:  
error: previous declaration ‘long double std::pow(long double, long  
double)’ here
/Developer/SDKs/MacOSX10.4u.sdk/usr/include/c++/4.0.0/cmath: In  
function ‘long double std::log(long double)’:
/Developer/SDKs/MacOSX10.4u.sdk/usr/include/c++/4.0.0/cmath:299:  
error: declaration of C function ‘long double std::log(long double)’  
conflicts with
/Developer/SDKs/MacOSX10.4u.sdk/usr/include/c++/4.0.0/cmath:295:  
error: previous declaration ‘float std::log(float)’ here
/Developer/SDKs/MacOSX10.4u.sdk/usr/include/c++/4.0.0/cmath: In  
function ‘float std::pow(float, int)’:
/Developer/SDKs/MacOSX10.4u.sdk/usr/include/c++/4.0.0/cmath:356:  
error: declaration of C function ‘float std::pow(float, int)’  
conflicts with
/Developer/SDKs/MacOSX10.4u.sdk/usr/include/c++/4.0.0/cmath:352:  
error: previous declaration ‘double std::pow(double, int)’ here
/Developer/SDKs/MacOSX10.4u.sdk/usr/include/c++/4.0.0/cmath: In  
function ‘long double std::pow(long double, int)’:
/Developer/SDKs/MacOSX10.4u.sdk/usr/include/c++/4.0.0/cmath:360:  
error: declaration of C function ‘long double std::pow(long double,  
int)’ conflicts with
/Developer/SDKs/MacOSX10.4u.sdk/usr/include/c++/4.0.0/cmath:356:  
error: previous declaration ‘float std::pow(float, int)’ here
/Developer/SDKs/MacOSX10.4u.sdk/usr/include/c++/4.0.0/cmath: At global  
scope:
/Developer/SDKs/MacOSX10.4u.sdk/usr/include/c++/4.0.0/cmath:304:  
error: template with C linkage
/Developer/SDKs/MacOSX10.4u.sdk/usr/include/c++/4.0.0/cmath: In  
function ‘long double std::sin(long double)’:
/Developer/SDKs/MacOSX10.4u.sdk/usr/include/c++/4.0.0/cmath:370:  
error: declaration of C function ‘long double std::sin(long double)’  
conflicts with
/Developer/SDKs/MacOSX10.4u.sdk/usr/include/c++/4.0.0/cmath:366:  
error: previous declaration ‘float std::sin(float)’ here
/Developer/SDKs/MacOSX10.4u.sdk/usr/include/c++/4.0.0/cmath: At global  
scope:
/Developer/SDKs/MacOSX10.4u.sdk/usr/include/c++/4.0.0/cmath:375:  
error: template with C linkage/Developer/SDKs/MacOSX10.4u.sdk/usr/ 
include/c++/4.0.0/cmath: In function ‘long double std::log10(long  
double)’:
/Developer/SDKs/MacOSX10.4u.sdk/usr/include/c++/4.0.0/cmath:314:  
error: declaration of C function ‘long double std::log10(long double)’  
conflicts with

/Developer/SDKs/MacOSX10.4u.sdk/usr/include/c++/4.0.0/cmath:310:  
error: previous declaration ‘float std::log10(float)’ here
/Developer/SDKs/MacOSX10.4u.sdk/usr/include/c++/4.0.0/cmath: At global  
scope:
/Developer/SDKs/MacOSX10.4u.sdk/usr/include/c++/4.0.0/cmath:319:  
error: template with C linkage
/Developer/SDKs/MacOSX10.4u.sdk/usr/include/c++/4.0.0/cmath: In  
function ‘long double std::sinh(long double)’:
/Developer/SDKs/MacOSX10.4u.sdk/usr/include/c++/4.0.0/cmath:385:  
error: declaration of C function ‘long double std::sinh(long double)’  
conflicts with
/Developer/SDKs/MacOSX10.4u.sdk/usr/include/c++/4.0.0/cmath:381:  
error: previous declaration ‘float std::sinh(float)’ here
/Developer/SDKs/MacOSX10.4u.sdk/usr/include/c++/4.0.0/cmath: At global  
scope:
/Developer/SDKs/MacOSX10.4u.sdk/usr/include/c++/4.0.0/cmath:390:  
error: template with C linkage
/Developer/SDKs/MacOSX10.4u.sdk/usr/include/c++/4.0.0/cmath: In  
function ‘long double std::modf(long double, long double*)’:
/Developer/SDKs/MacOSX10.4u.sdk/usr/include/c++/4.0.0/cmath:329:  
error: declaration of C function ‘long double std::modf(long double,  
long double*)’ conflicts with
/Developer/SDKs/MacOSX10.4u.sdk/usr/include/c++/4.0.0/cmath:325:  
error: previous declaration ‘float std::modf(float, float*)’ here
/Developer/SDKs/MacOSX10.4u.sdk/usr/include/c++/4.0.0/cmath: In  
function ‘long double std::sqrt(long double)’:
/Developer/SDKs/MacOSX10.4u.sdk/usr/include/c++/4.0.0/cmath:400:  
error: declaration of C function ‘long double std::sqrt(long double)’  
conflicts with
/Developer/SDKs/MacOSX10.4u.sdk/usr/include/c++/4.0.0/cmath:396:  
error: previous declaration ‘float std::sqrt(float)’ here
/Developer/SDKs/MacOSX10.4u.sdk/usr/include/c++/4.0.0/cmath: At global  
scope:
/Developer/SDKs/MacOSX10.4u.sdk/usr/include/c++/4.0.0/cmath:334:  
error: template with C linkage
/Developer/SDKs/MacOSX10.4u.sdk/usr/include/c++/4.0.0/cmath: At global  
scope:
/Developer/SDKs/MacOSX10.4u.sdk/usr/include/c++/4.0.0/cmath:405:  
error: template with C linkage
/Developer/SDKs/MacOSX10.4u.sdk/usr/include/c++/4.0.0/cmath: In  
function ‘long double std::pow(long double, long double)’:
/Developer/SDKs/MacOSX10.4u.sdk/usr/include/c++/4.0.0/cmath:348:  
error: declaration of C function ‘long double std::pow(long double,  
long double)’ conflicts with
/Developer/SDKs/MacOSX10.4u.sdk/usr/include/c++/4.0.0/cmath:344:  
error: previous declaration ‘float std::pow(float, float)’ here
/Developer/SDKs/MacOSX10.4u.sdk/usr/include/c++/4.0.0/cmath: In  
function ‘long double std::tan(long double)’:
/Developer/SDKs/MacOSX10.4u.sdk/usr/include/c++/4.0.0/cmath:415:  
error: declaration of C function ‘long double std::tan(long double)’  
conflicts with
/Developer/SDKs/MacOSX10.4u.sdk/usr/include/c++/4.0.0/cmath:411:  
error: previous declaration ‘float std::tan(float)’ here
/Developer/SDKs/MacOSX10.4u.sdk/usr/include/c++/4.0.0/cmath: In  
function ‘double std::pow(double, int)’:
/Developer/SDKs/MacOSX10.4u.sdk/usr/include/c++/4.0.0/cmath:352:  
error: declaration of C function ‘double std::pow(double, int)’  
conflicts with
/Developer/SDKs/MacOSX10.4u.sdk/usr/include/c++/4.0.0/cmath:348:  
error: previous declaration ‘long double std::pow(long double, long  
double)’ here
/Developer/SDKs/MacOSX10.4u.sdk/usr/include/c++/4.0.0/cmath: At global  
scope:
/Developer/SDKs/MacOSX10.4u.sdk/usr/include/c++/4.0.0/cmath:420:  
error: template with C linkage
/Developer/SDKs/MacOSX10.4u.sdk/usr/include/c++/4.0.0/cmath: In  
function ‘long double std::pow(long double, long double)’:
/Developer/SDKs/MacOSX10.4u.sdk/usr/include/c++/4.0.0/cmath:356:  
error: declaration of C function ‘float std::pow(float, int)’  
conflicts with
/Developer/SDKs/MacOSX10.4u.sdk/usr/include/c++/4.0.0/cmath:352:  
error: previous declaration ‘double std::pow(double, int)’ here
/Developer/SDKs/MacOSX10.4u.sdk/usr/include/c++/4.0.0/cmath: In  
function ‘long double std::tanh(long double)’:
/Developer/SDKs/MacOSX10.4u.sdk/usr/include/c++/4.0.0/cmath:430:  
error: declaration of C function ‘long double std::tanh(long double)’  
conflicts with
/Developer/SDKs/MacOSX10.4u.sdk/usr/include/c++/4.0.0/cmath:426:  
error: previous declaration ‘float std::tanh(float)’ here
/Developer/SDKs/MacOSX10.4u.sdk/usr/include/c++/4.0.0/cmath: In  
function ‘long double std::pow(long double, int)’:
/Developer/SDKs/MacOSX10.4u.sdk/usr/include/c++/4.0.0/cmath:360:  
error: declaration of C function ‘long double std::pow(long double,  
int)’ conflicts with
/Developer/SDKs/MacOSX10.4u.sdk/usr/include/c++/4.0.0/cmath:356:  
error: previous declaration ‘float std::pow(float, int)’ here
/Developer/SDKs/MacOSX10.4u.sdk/usr/include/c++/4.0.0/cmath: At global  
scope:
/Developer/SDKs/MacOSX10.4u.sdk/usr/include/c++/4.0.0/cmath:435:  
error: template with C linkage
/Developer/SDKs/MacOSX10.4u.sdk/usr/include/c++/4.0.0/cmath:448:  
error: template with C linkage
/Developer/SDKs/MacOSX10.4u.sdk/usr/include/c++/4.0.0/cmath:452:  
error: template with C linkage
/Developer/SDKs/MacOSX10.4u.sdk/usr/include/c++/4.0.0/cmath:456:  
error: template with C linkage
/Developer/SDKs/MacOSX10.4u.sdk/usr/include/c++/4.0.0/cmath:460:  
error: template with C linkage
/Developer/SDKs/MacOSX10.4u.sdk/usr/include/c++/4.0.0/cmath:464:  
error: template with C linkage
/Developer/SDKs/MacOSX10.4u.sdk/usr/include/c++/4.0.0/cmath:468:  
error: template with C linkage
/Developer/SDKs/MacOSX10.4u.sdk/usr/include/c++/4.0.0/cmath:472:  
error: template with C linkage
/Developer/SDKs/MacOSX10.4u.sdk/usr/include/c++/4.0.0/cmath:477:  
error: template with C linkage
/Developer/SDKs/MacOSX10.4u.sdk/usr/include/c++/4.0.0/cmath:482:  
error: template with C linkage
/Developer/SDKs/MacOSX10.4u.sdk/usr/include/c++/4.0.0/cmath: In  
function ‘long double std::sin(long double)’:
/Developer/SDKs/MacOSX10.4u.sdk/usr/include/c++/4.0.0/cmath:370:  
error: declaration of C function ‘long double std::sin(long double)’  
conflicts with
/Developer/SDKs/MacOSX10.4u.sdk/usr/include/c++/4.0.0/cmath:366:  
error: previous declaration ‘float std::sin(float)’ here
/Developer/SDKs/MacOSX10.4u.sdk/usr/include/c++/4.0.0/cmath:486:  
error: template with C linkage
/Developer/SDKs/MacOSX10.4u.sdk/usr/include/c++/4.0.0/cmath:491:  
error: template with C linkage
/Developer/SDKs/MacOSX10.4u.sdk/usr/include/c++/4.0.0/cmath:496:  
error: template with C linkage
/Developer/SDKs/MacOSX10.4u.sdk/usr/include/c++/4.0.0/cmath:518:  
error: template with C linkage
/Developer/SDKs/MacOSX10.4u.sdk/usr/include/c++/4.0.0/cmath: At global  
scope:
/Developer/SDKs/MacOSX10.4u.sdk/usr/include/c++/4.0.0/cmath:375:  
error: template with C linkage
/Developer/SDKs/MacOSX10.4u.sdk/usr/include/c++/4.0.0/cmath:522:  
error: template with C linkage
/Developer/SDKs/MacOSX10.4u.sdk/usr/include/c++/4.0.0/cmath:526:  
error: template with C linkage
/Developer/SDKs/MacOSX10.4u.sdk/usr/include/c++/4.0.0/cmath:530:  
error: template with C linkage
/Developer/SDKs/MacOSX10.4u.sdk/usr/include/c++/4.0.0/cmath: In  
function ‘long double std::sinh(long double)’:
/Developer/SDKs/MacOSX10.4u.sdk/usr/include/c++/4.0.0/cmath:385:  
error: declaration of C function ‘long double std::sinh(long double)’  
conflicts with
/Developer/SDKs/MacOSX10.4u.sdk/usr/include/c++/4.0.0/cmath:381:  
error: previous declaration ‘float std::sinh(float)’ here/Developer/ 
SDKs/MacOSX10.4u.sdk/usr/include/c++/4.0.0/cmath:534: error: template  
with C linkage
/Developer/SDKs/MacOSX10.4u.sdk/usr/include/c++/4.0.0/cmath:538:  
error: template with C linkage

/Developer/SDKs/MacOSX10.4u.sdk/usr/include/c++/4.0.0/cmath:542:  
error: template with C linkage
/Developer/SDKs/MacOSX10.4u.sdk/usr/include/c++/4.0.0/cmath:547:  
error: template with C linkage
/Developer/SDKs/MacOSX10.4u.sdk/usr/include/c++/4.0.0/cmath: At global  
scope:
/Developer/SDKs/MacOSX10.4u.sdk/usr/include/c++/4.0.0/cmath:390:  
error: template with C linkage
/Developer/SDKs/MacOSX10.4u.sdk/usr/include/c++/4.0.0/cmath:552:  
error: template with C linkage
/Developer/SDKs/MacOSX10.4u.sdk/usr/include/c++/4.0.0/cmath:557:  
error: template with C linkage
/Developer/SDKs/MacOSX10.4u.sdk/usr/include/c++/4.0.0/cmath:562:  
error: template with C linkage
/Developer/SDKs/MacOSX10.4u.sdk/usr/include/c++/4.0.0/cmath: In  
function ‘long double std::sqrt(long double)’:
/Developer/SDKs/MacOSX10.4u.sdk/usr/include/c++/4.0.0/cmath:400:  
error: declaration of C function ‘long double std::sqrt(long double)’  
conflicts with
/Developer/SDKs/MacOSX10.4u.sdk/usr/include/c++/4.0.0/cmath:567:  
error: template with C linkage/Developer/SDKs/MacOSX10.4u.sdk/usr/ 
include/c++/4.0.0/cmath:396: error: previous declaration ‘float  
std::sqrt(float)’ here

/Developer/SDKs/MacOSX10.4u.sdk/usr/include/c++/4.0.0/bits/cmath.tcc: 
39: error: template with C linkage
/Developer/SDKs/MacOSX10.4u.sdk/usr/include/c++/4.0.0/cmath: At global  
scope:
/Developer/SDKs/MacOSX10.4u.sdk/usr/include/c++/4.0.0/cmath:405:  
error: template with C linkage
/Developer/SDKs/MacOSX10.4u.sdk/usr/include/c++/4.0.0/cmath: In  
function ‘long double std::tan(long double)’:
/Developer/SDKs/MacOSX10.4u.sdk/usr/include/c++/4.0.0/cmath:415:  
error: declaration of C function ‘long double std::tan(long double)’  
conflicts with
/Developer/SDKs/MacOSX10.4u.sdk/usr/include/c++/4.0.0/cmath:411:  
error: previous declaration ‘float std::tan(float)’ here
/Developer/SDKs/MacOSX10.4u.sdk/usr/include/c++/4.0.0/cmath: At global  
scope:
/Developer/SDKs/MacOSX10.4u.sdk/usr/include/c++/4.0.0/cmath:420:  
error: template with C linkage
/Developer/SDKs/MacOSX10.4u.sdk/usr/include/c++/4.0.0/cmath: In  
function ‘long double std::tanh(long double)’:
/Developer/SDKs/MacOSX10.4u.sdk/usr/include/c++/4.0.0/cmath:430:  
error: declaration of C function ‘long double std::tanh(long double)’  
conflicts with
/Developer/SDKs/MacOSX10.4u.sdk/usr/include/c++/4.0.0/cmath:426:  
error: previous declaration ‘float std::tanh(float)’ here
/Developer/SDKs/MacOSX10.4u.sdk/usr/include/c++/4.0.0/cmath: At global  
scope:
/Developer/SDKs/MacOSX10.4u.sdk/usr/include/c++/4.0.0/cmath:435:  
error: template with C linkage
/Developer/SDKs/MacOSX10.4u.sdk/usr/include/c++/4.0.0/cmath:448:  
error: template with C linkage
/Developer/SDKs/MacOSX10.4u.sdk/usr/include/c++/4.0.0/cmath:452:  
error: template with C linkage
/Developer/SDKs/MacOSX10.4u.sdk/usr/include/c++/4.0.0/cmath:456:  
error: template with C linkage
/Developer/SDKs/MacOSX10.4u.sdk/usr/include/c++/4.0.0/cmath:460:  
error: template with C linkage
/Developer/SDKs/MacOSX10.4u.sdk/usr/include/c++/4.0.0/cmath:464:  
error: template with C linkage
/Developer/SDKs/MacOSX10.4u.sdk/usr/include/c++/4.0.0/cmath:468:  
error: template with C linkage
/Developer/SDKs/MacOSX10.4u.sdk/usr/include/c++/4.0.0/cmath:472:  
error: template with C linkage
/Developer/SDKs/MacOSX10.4u.sdk/usr/include/c++/4.0.0/cmath:477:  
error: template with C linkage
/Developer/SDKs/MacOSX10.4u.sdk/usr/include/c++/4.0.0/cmath:482:  
error: template with C linkage
/Developer/SDKs/MacOSX10.4u.sdk/usr/include/c++/4.0.0/cmath:486:  
error: template with C linkage
/Developer/SDKs/MacOSX10.4u.sdk/usr/include/c++/4.0.0/cmath:491:  
error: template with C linkage
/Developer/SDKs/MacOSX10.4u.sdk/usr/include/c++/4.0.0/cmath:496:  
error: template with C linkage
/Developer/SDKs/MacOSX10.4u.sdk/usr/include/c++/4.0.0/cmath:518:  
error: template with C linkage
/Developer/SDKs/MacOSX10.4u.sdk/usr/include/c++/4.0.0/cmath:522:  
error: template with C linkage
/Developer/SDKs/MacOSX10.4u.sdk/usr/include/c++/4.0.0/cmath:526:  
error: template with C linkage
/Developer/SDKs/MacOSX10.4u.sdk/usr/include/c++/4.0.0/cmath:530:  
error: template with C linkage
/Developer/SDKs/MacOSX10.4u.sdk/usr/include/c++/4.0.0/cmath:534:  
error: template with C linkage
/Developer/SDKs/MacOSX10.4u.sdk/usr/include/c++/4.0.0/cmath:538:  
error: template with C linkage
/Developer/SDKs/MacOSX10.4u.sdk/usr/include/c++/4.0.0/cmath:542:  
error: template with C linkage
/Developer/SDKs/MacOSX10.4u.sdk/usr/include/c++/4.0.0/cmath:547:  
error: template with C linkage
/Developer/SDKs/MacOSX10.4u.sdk/usr/include/c++/4.0.0/cmath:552:  
error: template with C linkage
/Developer/SDKs/MacOSX10.4u.sdk/usr/include/c++/4.0.0/cmath:557:  
error: template with C linkage
/Developer/SDKs/MacOSX10.4u.sdk/usr/include/c++/4.0.0/cmath:562:  
error: template with C linkage
/Developer/SDKs/MacOSX10.4u.sdk/usr/include/c++/4.0.0/cmath:567:  
error: template with C linkage
/Developer/SDKs/MacOSX10.4u.sdk/usr/include/c++/4.0.0/bits/cmath.tcc: 
39: error: template with C linkage
/Developer/SDKs/MacOSX10.4u.sdk/usr/include/c++/4.0.0/complex:55:  
error: template with C linkage
/Developer/SDKs/MacOSX10.4u.sdk/usr/include/c++/4.0.0/complex:61:  
error: template with C linkage
/Developer/SDKs/MacOSX10.4u.sdk/usr/include/c++/4.0.0/complex:63:  
error: template with C linkage
/Developer/SDKs/MacOSX10.4u.sdk/usr/include/c++/4.0.0/complex:65:  
error: template with C linkage
/Developer/SDKs/MacOSX10.4u.sdk/usr/include/c++/4.0.0/complex:68:  
error: template with C linkage
/Developer/SDKs/MacOSX10.4u.sdk/usr/include/c++/4.0.0/complex:70:  
error: template with C linkage
/Developer/SDKs/MacOSX10.4u.sdk/usr/include/c++/4.0.0/complex:74:  
error: template with C linkage
/Developer/SDKs/MacOSX10.4u.sdk/usr/include/c++/4.0.0/complex:76:  
error: template with C linkage
/Developer/SDKs/MacOSX10.4u.sdk/usr/include/c++/4.0.0/complex:78:  
error: template with C linkage
/Developer/SDKs/MacOSX10.4u.sdk/usr/include/c++/4.0.0/complex:80:  
error: template with C linkage
/Developer/SDKs/MacOSX10.4u.sdk/usr/include/c++/4.0.0/complex:82:  
error: template with C linkage
/Developer/SDKs/MacOSX10.4u.sdk/usr/include/c++/4.0.0/complex:84:  
error: template with C linkage
/Developer/SDKs/MacOSX10.4u.sdk/usr/include/c++/4.0.0/complex:86:  
error: template with C linkage
/Developer/SDKs/MacOSX10.4u.sdk/usr/include/c++/4.0.0/complex:89:  
error: template with C linkage
/Developer/SDKs/MacOSX10.4u.sdk/usr/include/c++/4.0.0/complex:91:  
error: template with C linkage
/Developer/SDKs/MacOSX10.4u.sdk/usr/include/c++/4.0.0/complex:93:  
error: template with C linkage
/Developer/SDKs/MacOSX10.4u.sdk/usr/include/c++/4.0.0/complex:95:  
error: template with C linkage
/Developer/SDKs/MacOSX10.4u.sdk/usr/include/c++/4.0.0/complex:97:  
error: template with C linkage
/Developer/SDKs/MacOSX10.4u.sdk/usr/include/c++/4.0.0/complex:99:  
error: template with C linkage
/Developer/SDKs/MacOSX10.4u.sdk/usr/include/c++/4.0.0/complex:101:  
error: template with C linkage
/Developer/SDKs/MacOSX10.4u.sdk/usr/include/c++/4.0.0/complex:128:  
error: template with C linkage
/Developer/SDKs/MacOSX10.4u.sdk/usr/include/c++/4.0.0/complex:155:  
error: template with C linkage
/Developer/SDKs/MacOSX10.4u.sdk/usr/include/c++/4.0.0/complex:158:  
error: template with C linkage
/Developer/SDKs/MacOSX10.4u.sdk/usr/include/c++/4.0.0/complex:161:  
error: template with C linkage
/Developer/SDKs/MacOSX10.4u.sdk/usr/include/c++/4.0.0/complex:164:  
error: template with C linkage
/Developer/SDKs/MacOSX10.4u.sdk/usr/include/c++/4.0.0/complex:167:  
error: template with C linkage
/Developer/SDKs/MacOSX10.4u.sdk/usr/include/c++/4.0.0/complex:55:  
error: template with C linkage
/Developer/SDKs/MacOSX10.4u.sdk/usr/include/c++/4.0.0/complex:61:  
error: template with C linkage
/Developer/SDKs/MacOSX10.4u.sdk/usr/include/c++/4.0.0/complex:63:  
error: template with C linkage
/Developer/SDKs/MacOSX10.4u.sdk/usr/include/c++/4.0.0/complex:65:  
error: template with C linkage
/Developer/SDKs/MacOSX10.4u.sdk/usr/include/c++/4.0.0/complex:318:  
error: template with C linkage
/Developer/SDKs/MacOSX10.4u.sdk/usr/include/c++/4.0.0/complex:68:  
error: template with C linkage
/Developer/SDKs/MacOSX10.4u.sdk/usr/include/c++/4.0.0/complex:70:  
error: template with C linkage
/Developer/SDKs/MacOSX10.4u.sdk/usr/include/c++/4.0.0/complex:74:  
error: template with C linkage/Developer/SDKs/MacOSX10.4u.sdk/usr/ 
include/c++/4.0.0/complex:327: error: template with C linkage

/Developer/SDKs/MacOSX10.4u.sdk/usr/include/c++/4.0.0/complex:76:  
error: template with C linkage
/Developer/SDKs/MacOSX10.4u.sdk/usr/include/c++/4.0.0/complex:336:  
error: template with C linkage/Developer/SDKs/MacOSX10.4u.sdk/usr/ 
include/c++/4.0.0/complex:78: error: template with C linkage

/Developer/SDKs/MacOSX10.4u.sdk/usr/include/c++/4.0.0/complex:80:  
error: template with C linkage
/Developer/SDKs/MacOSX10.4u.sdk/usr/include/c++/4.0.0/complex:348:  
error: template with C linkage
/Developer/SDKs/MacOSX10.4u.sdk/usr/include/c++/4.0.0/complex:357:  
error: template with C linkage
/Developer/SDKs/MacOSX10.4u.sdk/usr/include/c++/4.0.0/complex:82:  
error: template with C linkage
/Developer/SDKs/MacOSX10.4u.sdk/usr/include/c++/4.0.0/complex:366:  
error: template with C linkage/Developer/SDKs/MacOSX10.4u.sdk/usr/ 
include/c++/4.0.0/complex:84: error: template with C linkage

/Developer/SDKs/MacOSX10.4u.sdk/usr/include/c++/4.0.0/complex:86:  
error: template with C linkage
/Developer/SDKs/MacOSX10.4u.sdk/usr/include/c++/4.0.0/complex:378:  
error: template with C linkage/Developer/SDKs/MacOSX10.4u.sdk/usr/ 
include/c++/4.0.0/complex:89: error: template with C linkage

/Developer/SDKs/MacOSX10.4u.sdk/usr/include/c++/4.0.0/complex:91:  
error: template with C linkage
/Developer/SDKs/MacOSX10.4u.sdk/usr/include/c++/4.0.0/complex:93:  
error: template with C linkage
/Developer/SDKs/MacOSX10.4u.sdk/usr/include/c++/4.0.0/complex:387:  
error: template with C linkage
/Developer/SDKs/MacOSX10.4u.sdk/usr/include/c++/4.0.0/complex:95:  
error: template with C linkage
/Developer/SDKs/MacOSX10.4u.sdk/usr/include/c++/4.0.0/complex:396:  
error: template with C linkage/Developer/SDKs/MacOSX10.4u.sdk/usr/ 
include/c++/4.0.0/complex:97: error: template with C linkage

/Developer/SDKs/MacOSX10.4u.sdk/usr/include/c++/4.0.0/complex:99:  
error: template with C linkage
/Developer/SDKs/MacOSX10.4u.sdk/usr/include/c++/4.0.0/complex:101:  
error: template with C linkage
/Developer/SDKs/MacOSX10.4u.sdk/usr/include/c++/4.0.0/complex:408:  
error: template with C linkage
/Developer/SDKs/MacOSX10.4u.sdk/usr/include/c++/4.0.0/complex:417:  
error: template with C linkage
/Developer/SDKs/MacOSX10.4u.sdk/usr/include/c++/4.0.0/complex:128:  
error: template with C linkage
/Developer/SDKs/MacOSX10.4u.sdk/usr/include/c++/4.0.0/complex:426:  
error: template with C linkage
/Developer/SDKs/MacOSX10.4u.sdk/usr/include/c++/4.0.0/complex:437:  
error: template with C linkage
/Developer/SDKs/MacOSX10.4u.sdk/usr/include/c++/4.0.0/complex:443:  
error: template with C linkage
/Developer/SDKs/MacOSX10.4u.sdk/usr/include/c++/4.0.0/complex:155:  
error: template with C linkage
/Developer/SDKs/MacOSX10.4u.sdk/usr/include/c++/4.0.0/complex:158:  
error: template with C linkage
/Developer/SDKs/MacOSX10.4u.sdk/usr/include/c++/4.0.0/complex:161:  
error: template with C linkage
/Developer/SDKs/MacOSX10.4u.sdk/usr/include/c++/4.0.0/complex:164:  
error: template with C linkage
/Developer/SDKs/MacOSX10.4u.sdk/usr/include/c++/4.0.0/complex:450:  
error: template with C linkage
/Developer/SDKs/MacOSX10.4u.sdk/usr/include/c++/4.0.0/complex:167:  
error: template with C linkage
/Developer/SDKs/MacOSX10.4u.sdk/usr/include/c++/4.0.0/complex:455:  
error: template with C linkage
/Developer/SDKs/MacOSX10.4u.sdk/usr/include/c++/4.0.0/complex:460:  
error: template with C linkage
/Developer/SDKs/MacOSX10.4u.sdk/usr/include/c++/4.0.0/complex:468:  
error: template with C linkage
/Developer/SDKs/MacOSX10.4u.sdk/usr/include/c++/4.0.0/complex:473:  
error: template with C linkage
/Developer/SDKs/MacOSX10.4u.sdk/usr/include/c++/4.0.0/complex:478:  
error: template with C linkage
/Developer/SDKs/MacOSX10.4u.sdk/usr/include/c++/4.0.0/complex:485:  
error: template with C linkage
/Developer/SDKs/MacOSX10.4u.sdk/usr/include/c++/4.0.0/complex:518:  
error: template with C linkage
/Developer/SDKs/MacOSX10.4u.sdk/usr/include/c++/4.0.0/complex:531:  
error: template with C linkage
/Developer/SDKs/MacOSX10.4u.sdk/usr/include/c++/4.0.0/complex:536:  
error: template with C linkage
/Developer/SDKs/MacOSX10.4u.sdk/usr/include/c++/4.0.0/complex:541:  
error: template with C linkage
/Developer/SDKs/MacOSX10.4u.sdk/usr/include/c++/4.0.0/complex:546:  
error: template with C linkage
/Developer/SDKs/MacOSX10.4u.sdk/usr/include/c++/4.0.0/complex:318:  
error: template with C linkage
/Developer/SDKs/MacOSX10.4u.sdk/usr/include/c++/4.0.0/complex:552:  
error: template with C linkage
/Developer/SDKs/MacOSX10.4u.sdk/usr/include/c++/4.0.0/complex:327:  
error: template with C linkage
/Developer/SDKs/MacOSX10.4u.sdk/usr/include/c++/4.0.0/complex:336:  
error: template with C linkage
/Developer/SDKs/MacOSX10.4u.sdk/usr/include/c++/4.0.0/complex:348:  
error: template with C linkage
/Developer/SDKs/MacOSX10.4u.sdk/usr/include/c++/4.0.0/complex: In  
function ‘double std::__complex_abs(double __complex__)’:
/Developer/SDKs/MacOSX10.4u.sdk/usr/include/c++/4.0.0/complex:569:  
error: declaration of C function ‘double std::__complex_abs(double  
__complex__)’ conflicts with
/Developer/SDKs/MacOSX10.4u.sdk/usr/include/c++/4.0.0/complex:566:  
error: previous declaration ‘float std::__complex_abs(float  
__complex__)’ here
/Developer/SDKs/MacOSX10.4u.sdk/usr/include/c++/4.0.0/complex:357:  
error: template with C linkage
/Developer/SDKs/MacOSX10.4u.sdk/usr/include/c++/4.0.0/complex: In  
function ‘long double std::__complex_abs(const long double  
__complex__&)’:
/Developer/SDKs/MacOSX10.4u.sdk/usr/include/c++/4.0.0/complex:572:  
error: declaration of C function ‘long double std::__complex_abs(const  
long double __complex__&)’ conflicts with
/Developer/SDKs/MacOSX10.4u.sdk/usr/include/c++/4.0.0/complex:366:  
error: template with C linkage
/Developer/SDKs/MacOSX10.4u.sdk/usr/include/c++/4.0.0/complex:569:  
error: previous declaration ‘double std::__complex_abs(double  
__complex__)’ here
/Developer/SDKs/MacOSX10.4u.sdk/usr/include/c++/4.0.0/complex:378:  
error: template with C linkage
/Developer/SDKs/MacOSX10.4u.sdk/usr/include/c++/4.0.0/complex: At  
global scope:
/Developer/SDKs/MacOSX10.4u.sdk/usr/include/c++/4.0.0/complex:577:  
error: template with C linkage
/Developer/SDKs/MacOSX10.4u.sdk/usr/include/c++/4.0.0/complex:387:  
error: template with C linkage
/Developer/SDKs/MacOSX10.4u.sdk/usr/include/c++/4.0.0/complex:588:  
error: template with C linkage
/Developer/SDKs/MacOSX10.4u.sdk/usr/include/c++/4.0.0/complex:396:  
error: template with C linkage
/Developer/SDKs/MacOSX10.4u.sdk/usr/include/c++/4.0.0/complex: In  
function ‘double std::__complex_arg(double __complex__)’:
/Developer/SDKs/MacOSX10.4u.sdk/usr/include/c++/4.0.0/complex:596:  
error: declaration of C function ‘double std::__complex_arg(double  
__complex__)’ conflicts with
/Developer/SDKs/MacOSX10.4u.sdk/usr/include/c++/4.0.0/complex:593:  
error: previous declaration ‘float std::__complex_arg(float  
__complex__)’ here
/Developer/SDKs/MacOSX10.4u.sdk/usr/include/c++/4.0.0/complex: In  
function ‘long double std::__complex_arg(const long double  
__complex__&)’:
/Developer/SDKs/MacOSX10.4u.sdk/usr/include/c++/4.0.0/complex:599:  
error: declaration of C function ‘long double std::__complex_arg(const  
long double __complex__&)’ conflicts with
/Developer/SDKs/MacOSX10.4u.sdk/usr/include/c++/4.0.0/complex:596:  
error: previous declaration ‘double std::__complex_arg(double  
__complex__)’ here
/Developer/SDKs/MacOSX10.4u.sdk/usr/include/c++/4.0.0/complex:408:  
error: template with C linkage
/Developer/SDKs/MacOSX10.4u.sdk/usr/include/c++/4.0.0/complex: At  
global scope:
/Developer/SDKs/MacOSX10.4u.sdk/usr/include/c++/4.0.0/complex:604:  
error: template with C linkage
/Developer/SDKs/MacOSX10.4u.sdk/usr/include/c++/4.0.0/complex:417:  
error: template with C linkage
/Developer/SDKs/MacOSX10.4u.sdk/usr/include/c++/4.0.0/complex:617:  
error: template with C linkage
/Developer/SDKs/MacOSX10.4u.sdk/usr/include/c++/4.0.0/complex:426:  
error: template with C linkage
/Developer/SDKs/MacOSX10.4u.sdk/usr/include/c++/4.0.0/complex:620:  
error: template with C linkage
/Developer/SDKs/MacOSX10.4u.sdk/usr/include/c++/4.0.0/complex:437:  
error: template with C linkage
/Developer/SDKs/MacOSX10.4u.sdk/usr/include/c++/4.0.0/complex:632:  
error: template with C linkage
/Developer/SDKs/MacOSX10.4u.sdk/usr/include/c++/4.0.0/complex:443:  
error: template with C linkage
/Developer/SDKs/MacOSX10.4u.sdk/usr/include/c++/4.0.0/complex:450:  
error: template with C linkage
/Developer/SDKs/MacOSX10.4u.sdk/usr/include/c++/4.0.0/complex:641:  
error: template with C linkage
/Developer/SDKs/MacOSX10.4u.sdk/usr/include/c++/4.0.0/complex:455:  
error: template with C linkage
/Developer/SDKs/MacOSX10.4u.sdk/usr/include/c++/4.0.0/complex:649:  
error: template with C linkage
/Developer/SDKs/MacOSX10.4u.sdk/usr/include/c++/4.0.0/complex:460:  
error: template with C linkage
/Developer/SDKs/MacOSX10.4u.sdk/usr/include/c++/4.0.0/complex:654:  
error: template with C linkage
/Developer/SDKs/MacOSX10.4u.sdk/usr/include/c++/4.0.0/complex:468:  
error: template with C linkage
/Developer/SDKs/MacOSX10.4u.sdk/usr/include/c++/4.0.0/complex:662:  
error: template with C linkage
/Developer/SDKs/MacOSX10.4u.sdk/usr/include/c++/4.0.0/complex:473:  
error: template with C linkage
/Developer/SDKs/MacOSX10.4u.sdk/usr/include/c++/4.0.0/complex:478:  
error: template with C linkage
/Developer/SDKs/MacOSX10.4u.sdk/usr/include/c++/4.0.0/complex:485:  
error: template with C linkage
/Developer/SDKs/MacOSX10.4u.sdk/usr/include/c++/4.0.0/complex: In  
function ‘double __complex__ std::__complex_cos(double __complex__)’:
/Developer/SDKs/MacOSX10.4u.sdk/usr/include/c++/4.0.0/complex:674:  
error: declaration of C function ‘double __complex__  
std::__complex_cos(double __complex__)’ conflicts with
/Developer/SDKs/MacOSX10.4u.sdk/usr/include/c++/4.0.0/complex:671:  
error: previous declaration ‘float __complex__  
std::__complex_cos(float __complex__)’ here
/Developer/SDKs/MacOSX10.4u.sdk/usr/include/c++/4.0.0/complex: In  
function ‘long double __complex__ std::__complex_cos(const long double  
__complex__&)’:
/Developer/SDKs/MacOSX10.4u.sdk/usr/include/c++/4.0.0/complex:677:  
error: declaration of C function ‘long double __complex__  
std::__complex_cos(const long double __complex__&)’ conflicts with
/Developer/SDKs/MacOSX10.4u.sdk/usr/include/c++/4.0.0/complex:674:  
error: previous declaration ‘double __complex__  
std::__complex_cos(double __complex__)’ here
/Developer/SDKs/MacOSX10.4u.sdk/usr/include/c++/4.0.0/complex:518:  
error: template with C linkage
/Developer/SDKs/MacOSX10.4u.sdk/usr/include/c++/4.0.0/complex: At  
global scope:
/Developer/SDKs/MacOSX10.4u.sdk/usr/include/c++/4.0.0/complex:682:  
error: template with C linkage
/Developer/SDKs/MacOSX10.4u.sdk/usr/include/c++/4.0.0/complex:692:  
error: template with C linkage
/Developer/SDKs/MacOSX10.4u.sdk/usr/include/c++/4.0.0/complex:531:  
error: template with C linkage
/Developer/SDKs/MacOSX10.4u.sdk/usr/include/c++/4.0.0/complex:536:  
error: template with C linkage
/Developer/SDKs/MacOSX10.4u.sdk/usr/include/c++/4.0.0/complex:541:  
error: template with C linkage
/Developer/SDKs/MacOSX10.4u.sdk/usr/include/c++/4.0.0/complex: In  
function ‘double __complex__ std::__complex_cosh(double __complex__)’:
/Developer/SDKs/MacOSX10.4u.sdk/usr/include/c++/4.0.0/complex:704:  
error: declaration of C function ‘double __complex__  
std::__complex_cosh(double __complex__)’ conflicts with
/Developer/SDKs/MacOSX10.4u.sdk/usr/include/c++/4.0.0/complex:701:  
error: previous declaration ‘float __complex__  
std::__complex_cosh(float __complex__)’ here
/Developer/SDKs/MacOSX10.4u.sdk/usr/include/c++/4.0.0/complex:546:  
error: template with C linkage
/Developer/SDKs/MacOSX10.4u.sdk/usr/include/c++/4.0.0/complex: In  
function ‘long double __complex__ std::__complex_cosh(const long  
double __complex__&)’:
/Developer/SDKs/MacOSX10.4u.sdk/usr/include/c++/4.0.0/complex:707:  
error: declaration of C function ‘long double __complex__  
std::__complex_cosh(const long double __complex__&)’ conflicts with
/Developer/SDKs/MacOSX10.4u.sdk/usr/include/c++/4.0.0/complex:704:  
error: previous declaration ‘double __complex__  
std::__complex_cosh(double __complex__)’ here
/Developer/SDKs/MacOSX10.4u.sdk/usr/include/c++/4.0.0/complex: At  
global scope:
/Developer/SDKs/MacOSX10.4u.sdk/usr/include/c++/4.0.0/complex:712:  
error: template with C linkage
/Developer/SDKs/MacOSX10.4u.sdk/usr/include/c++/4.0.0/complex:552:  
error: template with C linkage
/Developer/SDKs/MacOSX10.4u.sdk/usr/include/c++/4.0.0/complex:722:  
error: template with C linkage
/Developer/SDKs/MacOSX10.4u.sdk/usr/include/c++/4.0.0/complex: In  
function ‘double std::__complex_abs(double __complex__)’:
/Developer/SDKs/MacOSX10.4u.sdk/usr/include/c++/4.0.0/complex:569:  
error: declaration of C function ‘double std::__complex_abs(double  
__complex__)’ conflicts with
/Developer/SDKs/MacOSX10.4u.sdk/usr/include/c++/4.0.0/complex:566:  
error: previous declaration ‘float std::__complex_abs(float  
__complex__)’ here
/Developer/SDKs/MacOSX10.4u.sdk/usr/include/c++/4.0.0/complex: In  
function ‘double __complex__ std::__complex_exp(double __complex__)’:
/Developer/SDKs/MacOSX10.4u.sdk/usr/include/c++/4.0.0/complex:730:  
error: declaration of C function ‘double __complex__  
std::__complex_exp(double __complex__)’ conflicts with/Developer/SDKs/ 
MacOSX10.4u.sdk/usr/include/c++/4.0.0/complex: In function ‘long  
double std::__complex_abs(const long double __complex__&)’:
/Developer/SDKs/MacOSX10.4u.sdk/usr/include/c++/4.0.0/complex:572:  
error: declaration of C function ‘long double std::__complex_abs(const  
long double __complex__&)’ conflicts with

/Developer/SDKs/MacOSX10.4u.sdk/usr/include/c++/4.0.0/complex:727:  
error: previous declaration ‘float __complex__  
std::__complex_exp(float __complex__)’ here/Developer/SDKs/ 
MacOSX10.4u.sdk/usr/include/c++/4.0.0/complex:569: error: previous  
declaration ‘double std::__complex_abs(double __complex__)’ here

/Developer/SDKs/MacOSX10.4u.sdk/usr/include/c++/4.0.0/complex: In  
function ‘long double __complex__ std::__complex_exp(const long double  
__complex__&)’:
/Developer/SDKs/MacOSX10.4u.sdk/usr/include/c++/4.0.0/complex:733:  
error: declaration of C function ‘long double __complex__  
std::__complex_exp(const long double __complex__&)’ conflicts with
/Developer/SDKs/MacOSX10.4u.sdk/usr/include/c++/4.0.0/complex: At  
global scope:
/Developer/SDKs/MacOSX10.4u.sdk/usr/include/c++/4.0.0/complex:577:  
error: template with C linkage
/Developer/SDKs/MacOSX10.4u.sdk/usr/include/c++/4.0.0/complex:730:  
error: previous declaration ‘double __complex__  
std::__complex_exp(double __complex__)’ here
/Developer/SDKs/MacOSX10.4u.sdk/usr/include/c++/4.0.0/complex:588:  
error: template with C linkage
/Developer/SDKs/MacOSX10.4u.sdk/usr/include/c++/4.0.0/complex: At  
global scope:
/Developer/SDKs/MacOSX10.4u.sdk/usr/include/c++/4.0.0/complex:738:  
error: template with C linkage
/Developer/SDKs/MacOSX10.4u.sdk/usr/include/c++/4.0.0/complex:749:  
error: template with C linkage
/Developer/SDKs/MacOSX10.4u.sdk/usr/include/c++/4.0.0/complex: In  
function ‘double std::__complex_arg(double __complex__)’:
/Developer/SDKs/MacOSX10.4u.sdk/usr/include/c++/4.0.0/complex:596:  
error: declaration of C function ‘double std::__complex_arg(double  
__complex__)’ conflicts with
/Developer/SDKs/MacOSX10.4u.sdk/usr/include/c++/4.0.0/complex:593:  
error: previous declaration ‘float std::__complex_arg(float  
__complex__)’ here
/Developer/SDKs/MacOSX10.4u.sdk/usr/include/c++/4.0.0/complex:768:  
error: template with C linkage
/Developer/SDKs/MacOSX10.4u.sdk/usr/include/c++/4.0.0/complex: In  
function ‘long double std::__complex_arg(const long double  
__complex__&)’:
/Developer/SDKs/MacOSX10.4u.sdk/usr/include/c++/4.0.0/complex:599:  
error: declaration of C function ‘long double std::__complex_arg(const  
long double __complex__&)’ conflicts with
/Developer/SDKs/MacOSX10.4u.sdk/usr/include/c++/4.0.0/complex:772:  
error: template with C linkage
/Developer/SDKs/MacOSX10.4u.sdk/usr/include/c++/4.0.0/complex:596:  
error: previous declaration ‘double std::__complex_arg(double  
__complex__)’ here
/Developer/SDKs/MacOSX10.4u.sdk/usr/include/c++/4.0.0/complex: At  
global scope:
/Developer/SDKs/MacOSX10.4u.sdk/usr/include/c++/4.0.0/complex:604:  
error: template with C linkage/Developer/SDKs/MacOSX10.4u.sdk/usr/ 
include/c++/4.0.0/complex:778: error: template with C linkage

/Developer/SDKs/MacOSX10.4u.sdk/usr/include/c++/4.0.0/complex:617:  
error: template with C linkage
/Developer/SDKs/MacOSX10.4u.sdk/usr/include/c++/4.0.0/complex:620:  
error: template with C linkage
/Developer/SDKs/MacOSX10.4u.sdk/usr/include/c++/4.0.0/complex:632:  
error: template with C linkage
/Developer/SDKs/MacOSX10.4u.sdk/usr/include/c++/4.0.0/complex:641:  
error: template with C linkage
/Developer/SDKs/MacOSX10.4u.sdk/usr/include/c++/4.0.0/complex: In  
function ‘double __complex__ std::__complex_sin(double __complex__)’:
/Developer/SDKs/MacOSX10.4u.sdk/usr/include/c++/4.0.0/complex:790:  
error: declaration of C function ‘double __complex__  
std::__complex_sin(double __complex__)’ conflicts with
/Developer/SDKs/MacOSX10.4u.sdk/usr/include/c++/4.0.0/complex:649:  
error: template with C linkage
/Developer/SDKs/MacOSX10.4u.sdk/usr/include/c++/4.0.0/complex:787:  
error: previous declaration ‘float __complex__  
std::__complex_sin(float __complex__)’ here
/Developer/SDKs/MacOSX10.4u.sdk/usr/include/c++/4.0.0/complex:654:  
error: template with C linkage
/Developer/SDKs/MacOSX10.4u.sdk/usr/include/c++/4.0.0/complex: In  
function ‘long double __complex__ std::__complex_sin(const long double  
__complex__&)’:
/Developer/SDKs/MacOSX10.4u.sdk/usr/include/c++/4.0.0/complex:793:  
error: declaration of C function ‘long double __complex__  
std::__complex_sin(const long double __complex__&)’ conflicts with
/Developer/SDKs/MacOSX10.4u.sdk/usr/include/c++/4.0.0/complex:790:  
error: previous declaration ‘double __complex__  
std::__complex_sin(double __complex__)’ here
/Developer/SDKs/MacOSX10.4u.sdk/usr/include/c++/4.0.0/complex:662:  
error: template with C linkage
/Developer/SDKs/MacOSX10.4u.sdk/usr/include/c++/4.0.0/complex: At  
global scope:
/Developer/SDKs/MacOSX10.4u.sdk/usr/include/c++/4.0.0/complex:798:  
error: template with C linkage
/Developer/SDKs/MacOSX10.4u.sdk/usr/include/c++/4.0.0/complex:808:  
error: template with C linkage
/Developer/SDKs/MacOSX10.4u.sdk/usr/include/c++/4.0.0/complex: In  
function ‘double __complex__ std::__complex_cos(double __complex__)’:
/Developer/SDKs/MacOSX10.4u.sdk/usr/include/c++/4.0.0/complex:674:  
error: declaration of C function ‘double __complex__  
std::__complex_cos(double __complex__)’ conflicts with
/Developer/SDKs/MacOSX10.4u.sdk/usr/include/c++/4.0.0/complex:671:  
error: previous declaration ‘float __complex__  
std::__complex_cos(float __complex__)’ here
/Developer/SDKs/MacOSX10.4u.sdk/usr/include/c++/4.0.0/complex: In  
function ‘double __complex__ std::__complex_sinh(double __complex__)’:
/Developer/SDKs/MacOSX10.4u.sdk/usr/include/c++/4.0.0/complex:820:  
error: declaration of C function ‘double __complex__  
std::__complex_sinh(double __complex__)’ conflicts with/Developer/SDKs/ 
MacOSX10.4u.sdk/usr/include/c++/4.0.0/complex: In function ‘long  
double __complex__ std::__complex_cos(const long double __complex__&)’:
/Developer/SDKs/MacOSX10.4u.sdk/usr/include/c++/4.0.0/complex:677:  
error: declaration of C function ‘long double __complex__  
std::__complex_cos(const long double __complex__&)’ conflicts with

/Developer/SDKs/MacOSX10.4u.sdk/usr/include/c++/4.0.0/complex:817:  
error: previous declaration ‘float __complex__  
std::__complex_sinh(float __complex__)’ here/Developer/SDKs/ 
MacOSX10.4u.sdk/usr/include/c++/4.0.0/complex:674: error: previous  
declaration ‘double __complex__ std::__complex_cos(double  
__complex__)’ here

/Developer/SDKs/MacOSX10.4u.sdk/usr/include/c++/4.0.0/complex: In  
function ‘long double __complex__ std::__complex_sinh(const long  
double __complex__&)’:
/Developer/SDKs/MacOSX10.4u.sdk/usr/include/c++/4.0.0/complex:823:  
error: declaration of C function ‘long double __complex__  
std::__complex_sinh(const long double __complex__&)’ conflicts with
/Developer/SDKs/MacOSX10.4u.sdk/usr/include/c++/4.0.0/complex: At  
global scope:
/Developer/SDKs/MacOSX10.4u.sdk/usr/include/c++/4.0.0/complex:682:  
error: template with C linkage
/Developer/SDKs/MacOSX10.4u.sdk/usr/include/c++/4.0.0/complex:820:  
error: previous declaration ‘double __complex__  
std::__complex_sinh(double __complex__)’ here
/Developer/SDKs/MacOSX10.4u.sdk/usr/include/c++/4.0.0/complex:692:  
error: template with C linkage
/Developer/SDKs/MacOSX10.4u.sdk/usr/include/c++/4.0.0/complex: At  
global scope:
/Developer/SDKs/MacOSX10.4u.sdk/usr/include/c++/4.0.0/complex:828:  
error: template with C linkage
/Developer/SDKs/MacOSX10.4u.sdk/usr/include/c++/4.0.0/complex:839:  
error: template with C linkage
/Developer/SDKs/MacOSX10.4u.sdk/usr/include/c++/4.0.0/complex: In  
function ‘double __complex__ std::__complex_cosh(double __complex__)’:
/Developer/SDKs/MacOSX10.4u.sdk/usr/include/c++/4.0.0/complex:704:  
error: declaration of C function ‘double __complex__  
std::__complex_cosh(double __complex__)’ conflicts with
/Developer/SDKs/MacOSX10.4u.sdk/usr/include/c++/4.0.0/complex:701:  
error: previous declaration ‘float __complex__  
std::__complex_cosh(float __complex__)’ here
/Developer/SDKs/MacOSX10.4u.sdk/usr/include/c++/4.0.0/complex:707:  
error: declaration of C function ‘long double __complex__  
std::__complex_cosh(const long double __complex__&)’ conflicts with
/Developer/SDKs/MacOSX10.4u.sdk/usr/include/c++/4.0.0/complex:704:  
error: previous declaration ‘double __complex__  
std::__complex_cosh(double __complex__)’ here
/Developer/SDKs/MacOSX10.4u.sdk/usr/include/c++/4.0.0/complex: At  
global scope:
/Developer/SDKs/MacOSX10.4u.sdk/usr/include/c++/4.0.0/complex:712:  
error: template with C linkage
/Developer/SDKs/MacOSX10.4u.sdk/usr/include/c++/4.0.0/complex:722:  
error: template with C linkage
/Developer/SDKs/MacOSX10.4u.sdk/usr/include/c++/4.0.0/complex: In  
function ‘double __complex__ std::__complex_sqrt(double __complex__)’:
/Developer/SDKs/MacOSX10.4u.sdk/usr/include/c++/4.0.0/complex:864:  
error: declaration of C function ‘double __complex__  
std::__complex_sqrt(double __complex__)’ conflicts with
/Developer/SDKs/MacOSX10.4u.sdk/usr/include/c++/4.0.0/complex:861:  
error: previous declaration ‘float __complex__  
std::__complex_sqrt(float __complex__)’ here
/Developer/SDKs/MacOSX10.4u.sdk/usr/include/c++/4.0.0/complex: In  
function ‘double __complex__ std::__complex_exp(double __complex__)’:
/Developer/SDKs/MacOSX10.4u.sdk/usr/include/c++/4.0.0/complex:730:  
error: declaration of C function ‘double __complex__  
std::__complex_exp(double __complex__)’ conflicts with
/Developer/SDKs/MacOSX10.4u.sdk/usr/include/c++/4.0.0/complex:727:  
error: previous declaration ‘float __complex__  
std::__complex_exp(float __complex__)’ here
/Developer/SDKs/MacOSX10.4u.sdk/usr/include/c++/4.0.0/complex: In  
function ‘long double __complex__ std::__complex_sqrt(const long  
double __complex__&)’:
/Developer/SDKs/MacOSX10.4u.sdk/usr/include/c++/4.0.0/complex:867:  
error: declaration of C function ‘long double __complex__  
std::__complex_sqrt(const long double __complex__&)’ conflicts with
/Developer/SDKs/MacOSX10.4u.sdk/usr/include/c++/4.0.0/complex:864:  
error: previous declaration ‘double __complex__  
std::__complex_sqrt(double __complex__)’ here
/Developer/SDKs/MacOSX10.4u.sdk/usr/include/c++/4.0.0/complex: In  
function ‘long double __complex__ std::__complex_exp(const long double  
__complex__&)’:
/Developer/SDKs/MacOSX10.4u.sdk/usr/include/c++/4.0.0/complex:733:  
error: declaration of C function ‘long double __complex__  
std::__complex_exp(const long double __complex__&)’ conflicts with
/Developer/SDKs/MacOSX10.4u.sdk/usr/include/c++/4.0.0/complex:730:  
error: previous declaration ‘double __complex__  
std::__complex_exp(double __complex__)’ here
/Developer/SDKs/MacOSX10.4u.sdk/usr/include/c++/4.0.0/complex: At  
global scope:
/Developer/SDKs/MacOSX10.4u.sdk/usr/include/c++/4.0.0/complex:872:  
error: template with C linkage
/Developer/SDKs/MacOSX10.4u.sdk/usr/include/c++/4.0.0/complex: At  
global scope:
/Developer/SDKs/MacOSX10.4u.sdk/usr/include/c++/4.0.0/complex:738:  
error: template with C linkage
/Developer/SDKs/MacOSX10.4u.sdk/usr/include/c++/4.0.0/complex:883:  
error: template with C linkage
/Developer/SDKs/MacOSX10.4u.sdk/usr/include/c++/4.0.0/complex:749:  
error: template with C linkage
/Developer/SDKs/MacOSX10.4u.sdk/usr/include/c++/4.0.0/complex:768:  
error: template with C linkage
/Developer/SDKs/MacOSX10.4u.sdk/usr/include/c++/4.0.0/complex: In  
function ‘double __complex__ std::__complex_tan(double __complex__)’:
/Developer/SDKs/MacOSX10.4u.sdk/usr/include/c++/4.0.0/complex:891:  
error: declaration of C function ‘double __complex__  
std::__complex_tan(double __complex__)’ conflicts with
/Developer/SDKs/MacOSX10.4u.sdk/usr/include/c++/4.0.0/complex:888:  
error: previous declaration ‘float __complex__  
std::__complex_tan(float __complex__)’ here
/Developer/SDKs/MacOSX10.4u.sdk/usr/include/c++/4.0.0/complex:772:  
error: template with C linkage
/Developer/SDKs/MacOSX10.4u.sdk/usr/include/c++/4.0.0/complex: In  
function ‘long double __complex__ std::__complex_tan(const long double  
__complex__&)’:
/Developer/SDKs/MacOSX10.4u.sdk/usr/include/c++/4.0.0/complex:894:  
error: declaration of C function ‘long double __complex__  
std::__complex_tan(const long double __complex__&)’ conflicts with
/Developer/SDKs/MacOSX10.4u.sdk/usr/include/c++/4.0.0/complex:778:  
error: template with C linkage
/Developer/SDKs/MacOSX10.4u.sdk/usr/include/c++/4.0.0/complex:891:  
error: previous declaration ‘double __complex__  
std::__complex_tan(double __complex__)’ here
/Developer/SDKs/MacOSX10.4u.sdk/usr/include/c++/4.0.0/complex: At  
global scope:
/Developer/SDKs/MacOSX10.4u.sdk/usr/include/c++/4.0.0/complex:899:  
error: template with C linkage
/Developer/SDKs/MacOSX10.4u.sdk/usr/include/c++/4.0.0/complex:911:  
error: template with C linkage
/Developer/SDKs/MacOSX10.4u.sdk/usr/include/c++/4.0.0/complex: In  
function ‘double __complex__ std::__complex_sin(double __complex__)’:
/Developer/SDKs/MacOSX10.4u.sdk/usr/include/c++/4.0.0/complex:790:  
error: declaration of C function ‘double __complex__  
std::__complex_sin(double __complex__)’ conflicts with
/Developer/SDKs/MacOSX10.4u.sdk/usr/include/c++/4.0.0/complex:787:  
error: previous declaration ‘float __complex__  
std::__complex_sin(float __complex__)’ here
/Developer/SDKs/MacOSX10.4u.sdk/usr/include/c++/4.0.0/complex: In  
function ‘long double __complex__ std::__complex_sin(const long double  
__complex__&)’:
/Developer/SDKs/MacOSX10.4u.sdk/usr/include/c++/4.0.0/complex:793:  
error: declaration of C function ‘long double __complex__  
std::__complex_sin(const long double __complex__&)’ conflicts with
/Developer/SDKs/MacOSX10.4u.sdk/usr/include/c++/4.0.0/complex: In  
function ‘double __complex__ std::__complex_tanh(double __complex__)’:
/Developer/SDKs/MacOSX10.4u.sdk/usr/include/c++/4.0.0/complex:919:  
error: declaration of C function ‘double __complex__  
std::__complex_tanh(double __complex__)’ conflicts with
/Developer/SDKs/MacOSX10.4u.sdk/usr/include/c++/4.0.0/complex:790:  
error: previous declaration ‘double __complex__  
std::__complex_sin(double __complex__)’ here
/Developer/SDKs/MacOSX10.4u.sdk/usr/include/c++/4.0.0/complex:916:  
error: previous declaration ‘float __complex__  
std::__complex_tanh(float __complex__)’ here
/Developer/SDKs/MacOSX10.4u.sdk/usr/include/c++/4.0.0/complex: At  
global scope:
/Developer/SDKs/MacOSX10.4u.sdk/usr/include/c++/4.0.0/complex:798:  
error: template with C linkage
/Developer/SDKs/MacOSX10.4u.sdk/usr/include/c++/4.0.0/complex: In  
function ‘long double __complex__ std::__complex_tanh(const long  
double __complex__&)’:
/Developer/SDKs/MacOSX10.4u.sdk/usr/include/c++/4.0.0/complex:922:  
error: declaration of C function ‘long double __complex__  
std::__complex_tanh(const long double __complex__&)’ conflicts with
/Developer/SDKs/MacOSX10.4u.sdk/usr/include/c++/4.0.0/complex:919:  
error: previous declaration ‘double __complex__  
std::__complex_tanh(double __complex__)’ here
/Developer/SDKs/MacOSX10.4u.sdk/usr/include/c++/4.0.0/complex:808:  
error: template with C linkage
/Developer/SDKs/MacOSX10.4u.sdk/usr/include/c++/4.0.0/complex: At  
global scope:
/Developer/SDKs/MacOSX10.4u.sdk/usr/include/c++/4.0.0/complex:927:  
error: template with C linkage
/Developer/SDKs/MacOSX10.4u.sdk/usr/include/c++/4.0.0/complex:940:  
error: template with C linkage
/Developer/SDKs/MacOSX10.4u.sdk/usr/include/c++/4.0.0/complex: In  
function ‘double __complex__ std::__complex_sinh(double __complex__)’:
/Developer/SDKs/MacOSX10.4u.sdk/usr/include/c++/4.0.0/complex:820:  
error: declaration of C function ‘double __complex__  
std::__complex_sinh(double __complex__)’ conflicts with
/Developer/SDKs/MacOSX10.4u.sdk/usr/include/c++/4.0.0/complex:817:  
error: previous declaration ‘float __complex__  
std::__complex_sinh(float __complex__)’ here
/Developer/SDKs/MacOSX10.4u.sdk/usr/include/c++/4.0.0/complex:945:  
error: template with C linkage
/Developer/SDKs/MacOSX10.4u.sdk/usr/include/c++/4.0.0/complex: In  
function ‘long double __complex__ std::__complex_sinh(const long  
double __complex__&)’:
/Developer/SDKs/MacOSX10.4u.sdk/usr/include/c++/4.0.0/complex:823:  
error: declaration of C function ‘long double __complex__  
std::__complex_sinh(const long double __complex__&)’ conflicts with
/Developer/SDKs/MacOSX10.4u.sdk/usr/include/c++/4.0.0/complex:820:  
error: previous declaration ‘double __complex__  
std::__complex_sinh(double __complex__)’ here
/Developer/SDKs/MacOSX10.4u.sdk/usr/include/c++/4.0.0/complex:960:  
error: template with C linkage
/Developer/SDKs/MacOSX10.4u.sdk/usr/include/c++/4.0.0/complex: At  
global scope:
/Developer/SDKs/MacOSX10.4u.sdk/usr/include/c++/4.0.0/complex:828:  
error: template with C linkage
/Developer/SDKs/MacOSX10.4u.sdk/usr/include/c++/4.0.0/complex:839:  
error: template with C linkage
/Developer/SDKs/MacOSX10.4u.sdk/usr/include/c++/4.0.0/complex: In  
function ‘double __complex__ std::__complex_pow(double __complex__,  
double __complex__)’:
/Developer/SDKs/MacOSX10.4u.sdk/usr/include/c++/4.0.0/complex:969:  
error: declaration of C function ‘double __complex__  
std::__complex_pow(double __complex__, double __complex__)’ conflicts  
with
/Developer/SDKs/MacOSX10.4u.sdk/usr/include/c++/4.0.0/complex:965:  
error: previous declaration ‘float __complex__  
std::__complex_pow(float __complex__, float __complex__)’ here
/Developer/SDKs/MacOSX10.4u.sdk/usr/include/c++/4.0.0/complex: In  
function ‘long double __complex__ std::__complex_pow(const long double  
__complex__&, const long double __complex__&)’:
/Developer/SDKs/MacOSX10.4u.sdk/usr/include/c++/4.0.0/complex:974:  
error: declaration of C function ‘long double __complex__  
std::__complex_pow(const long double __complex__&, const long double  
__complex__&)’ conflicts with
/Developer/SDKs/MacOSX10.4u.sdk/usr/include/c++/4.0.0/complex:969:  
error: previous declaration ‘double __complex__  
std::__complex_pow(double __complex__, double __complex__)’ here
/Developer/SDKs/MacOSX10.4u.sdk/usr/include/c++/4.0.0/complex: At  
global scope:
/Developer/SDKs/MacOSX10.4u.sdk/usr/include/c++/4.0.0/complex:979:  
error: template with C linkage
/Developer/SDKs/MacOSX10.4u.sdk/usr/include/c++/4.0.0/complex:990:  
error: template with C linkage
/Developer/SDKs/MacOSX10.4u.sdk/usr/include/c++/4.0.0/complex:1027:  
error: template with C linkage
/Developer/SDKs/MacOSX10.4u.sdk/usr/include/c++/4.0.0/complex:1029:  
error: template with C linkage
/Developer/SDKs/MacOSX10.4u.sdk/usr/include/c++/4.0.0/complex:1031:  
error: template with C linkage
/Developer/SDKs/MacOSX10.4u.sdk/usr/include/c++/4.0.0/complex:1033:  
error: template with C linkage
/Developer/SDKs/MacOSX10.4u.sdk/usr/include/c++/4.0.0/complex:1035:  
error: template with C linkage
/Developer/SDKs/MacOSX10.4u.sdk/usr/include/c++/4.0.0/complex: In  
function ‘double __complex__ std::__complex_sqrt(double __complex__)’:
/Developer/SDKs/MacOSX10.4u.sdk/usr/include/c++/4.0.0/complex:864:  
error: declaration of C function ‘double __complex__  
std::__complex_sqrt(double __complex__)’ conflicts with
/Developer/SDKs/MacOSX10.4u.sdk/usr/include/c++/4.0.0/complex:861:  
error: previous declaration ‘float __complex__  
std::__complex_sqrt(float __complex__)’ here
/Developer/SDKs/MacOSX10.4u.sdk/usr/include/c++/4.0.0/complex: In  
function ‘long double __complex__ std::__complex_sqrt(const long  
double __complex__&)’:
/Developer/SDKs/MacOSX10.4u.sdk/usr/include/c++/4.0.0/complex:867:  
error: declaration of C function ‘long double __complex__  
std::__complex_sqrt(const long double __complex__&)’ conflicts with
/Developer/SDKs/MacOSX10.4u.sdk/usr/include/c++/4.0.0/complex:864:  
error: previous declaration ‘double __complex__  
std::__complex_sqrt(double __complex__)’ here
/Developer/SDKs/MacOSX10.4u.sdk/usr/include/c++/4.0.0/complex: At  
global scope:
/Developer/SDKs/MacOSX10.4u.sdk/usr/include/c++/4.0.0/complex:872:  
error: template with C linkage
/Developer/SDKs/MacOSX10.4u.sdk/usr/include/c++/4.0.0/complex:883:  
error: template with C linkage
/Developer/SDKs/MacOSX10.4u.sdk/usr/include/c++/4.0.0/complex: In  
function ‘double __complex__ std::__complex_tan(double __complex__)’:
/Developer/SDKs/MacOSX10.4u.sdk/usr/include/c++/4.0.0/complex:891:  
error: declaration of C function ‘double __complex__  
std::__complex_tan(double __complex__)’ conflicts with
/Developer/SDKs/MacOSX10.4u.sdk/usr/include/c++/4.0.0/complex:888:  
error: previous declaration ‘float __complex__  
std::__complex_tan(float __complex__)’ here
/Developer/SDKs/MacOSX10.4u.sdk/usr/include/c++/4.0.0/complex: In  
function ‘long double __complex__ std::__complex_tan(const long double  
__complex__&)’:
/Developer/SDKs/MacOSX10.4u.sdk/usr/include/c++/4.0.0/complex:894:  
error: declaration of C function ‘long double __complex__  
std::__complex_tan(const long double __complex__&)’ conflicts with
/Developer/SDKs/MacOSX10.4u.sdk/usr/include/c++/4.0.0/complex:891:  
error: previous declaration ‘double __complex__  
std::__complex_tan(double __complex__)’ here
/Developer/SDKs/MacOSX10.4u.sdk/usr/include/c++/4.0.0/complex: At  
global scope:
/Developer/SDKs/MacOSX10.4u.sdk/usr/include/c++/4.0.0/complex:899:  
error: template with C linkage
/Developer/SDKs/MacOSX10.4u.sdk/usr/include/c++/4.0.0/complex:911:  
error: template with C linkage
/Developer/SDKs/MacOSX10.4u.sdk/usr/include/c++/4.0.0/complex: In  
function ‘double __complex__ std::__complex_tanh(double __complex__)’:
/Developer/SDKs/MacOSX10.4u.sdk/usr/include/c++/4.0.0/complex:919:  
error: declaration of C function ‘double __complex__  
std::__complex_tanh(double __complex__)’ conflicts with
/Developer/SDKs/MacOSX10.4u.sdk/usr/include/c++/4.0.0/complex:916:  
error: previous declaration ‘float __complex__  
std::__complex_tanh(float __complex__)’ here
/Developer/SDKs/MacOSX10.4u.sdk/usr/include/c++/4.0.0/complex: In  
function ‘long double __complex__ std::__complex_tanh(const long  
double __complex__&)’:
/Developer/SDKs/MacOSX10.4u.sdk/usr/include/c++/4.0.0/complex:922:  
error: declaration of C function ‘long double __complex__  
std::__complex_tanh(const long double __complex__&)’ conflicts with
/Developer/SDKs/MacOSX10.4u.sdk/usr/include/c++/4.0.0/complex:919:  
error: previous declaration ‘double __complex__  
std::__complex_tanh(double __complex__)’ here
/Developer/SDKs/MacOSX10.4u.sdk/usr/include/c++/4.0.0/complex: At  
global scope:
/Developer/SDKs/MacOSX10.4u.sdk/usr/include/c++/4.0.0/complex:927:  
error: template with C linkage
/Developer/SDKs/MacOSX10.4u.sdk/usr/include/c++/4.0.0/complex:940:  
error: template with C linkage
/Developer/SDKs/MacOSX10.4u.sdk/usr/include/c++/4.0.0/complex:945:  
error: template with C linkage
/Developer/SDKs/MacOSX10.4u.sdk/usr/include/c++/4.0.0/complex:960:  
error: template with C linkage
/Developer/SDKs/MacOSX10.4u.sdk/usr/include/c++/4.0.0/complex: In  
function ‘double __complex__ std::__complex_pow(double __complex__,  
double __complex__)’:
/Developer/SDKs/MacOSX10.4u.sdk/usr/include/c++/4.0.0/complex:969:  
error: declaration of C function ‘double __complex__  
std::__complex_pow(double __complex__, double __complex__)’ conflicts  
with
/Developer/SDKs/MacOSX10.4u.sdk/usr/include/c++/4.0.0/complex:965:  
error: previous declaration ‘float __complex__  
std::__complex_pow(float __complex__, float __complex__)’ here
/Developer/SDKs/MacOSX10.4u.sdk/usr/include/c++/4.0.0/complex: In  
function ‘long double __complex__ std::__complex_pow(const long double  
__complex__&, const long double __complex__&)’:
/Developer/SDKs/MacOSX10.4u.sdk/usr/include/c++/4.0.0/complex:974:  
error: declaration of C function ‘long double __complex__  
std::__complex_pow(const long double __complex__&, const long double  
__complex__&)’ conflicts with
/Developer/SDKs/MacOSX10.4u.sdk/usr/include/c++/4.0.0/complex:969:  
error: previous declaration ‘double __complex__  
std::__complex_pow(double __complex__, double __complex__)’ here
/Developer/SDKs/MacOSX10.4u.sdk/usr/include/c++/4.0.0/complex: At  
global scope:
/Developer/SDKs/MacOSX10.4u.sdk/usr/include/c++/4.0.0/complex:979:  
error: template with C linkage
/Developer/SDKs/MacOSX10.4u.sdk/usr/include/c++/4.0.0/complex:990:  
error: template with C linkage
/Developer/SDKs/MacOSX10.4u.sdk/usr/include/c++/4.0.0/complex:1180:  
error: template with C linkage
/Developer/SDKs/MacOSX10.4u.sdk/usr/include/c++/4.0.0/complex:1182:  
error: template with C linkage
/Developer/SDKs/MacOSX10.4u.sdk/usr/include/c++/4.0.0/complex:1184:  
error: template with C linkage
/Developer/SDKs/MacOSX10.4u.sdk/usr/include/c++/4.0.0/complex:1027:  
error: template with C linkage
/Developer/SDKs/MacOSX10.4u.sdk/usr/include/c++/4.0.0/complex:1186:  
error: template with C linkage
/Developer/SDKs/MacOSX10.4u.sdk/usr/include/c++/4.0.0/complex:1029:  
error: template with C linkage
/Developer/SDKs/MacOSX10.4u.sdk/usr/include/c++/4.0.0/complex:1188:  
error: template with C linkage
/Developer/SDKs/MacOSX10.4u.sdk/usr/include/c++/4.0.0/complex:1031:  
error: template with C linkage
/Developer/SDKs/MacOSX10.4u.sdk/usr/include/c++/4.0.0/complex:1033:  
error: template with C linkage
/Developer/SDKs/MacOSX10.4u.sdk/usr/include/c++/4.0.0/complex:1035:  
error: template with C linkage
/Developer/SDKs/MacOSX10.4u.sdk/usr/include/c++/4.0.0/complex:1333:  
error: template with C linkage
/Developer/SDKs/MacOSX10.4u.sdk/usr/include/c++/4.0.0/complex:1335:  
error: template with C linkage
/Developer/SDKs/MacOSX10.4u.sdk/usr/include/c++/4.0.0/complex:1337:  
error: template with C linkage
/Developer/SDKs/MacOSX10.4u.sdk/usr/include/c++/4.0.0/complex:1339:  
error: template with C linkage
/Developer/SDKs/MacOSX10.4u.sdk/usr/include/c++/4.0.0/complex:1341:  
error: template with C linkage
/Developer/SDKs/MacOSX10.4u.sdk/usr/include/c++/4.0.0/complex:1180:  
error: template with C linkage
/Developer/SDKs/MacOSX10.4u.sdk/usr/include/c++/4.0.0/complex:1182:  
error: template with C linkage
/Developer/SDKs/MacOSX10.4u.sdk/usr/include/c++/4.0.0/complex:1184:  
error: template with C linkage
/Developer/SDKs/MacOSX10.4u.sdk/usr/include/c++/4.0.0/complex:1186:  
error: template with C linkage
/Developer/SDKs/MacOSX10.4u.sdk/usr/include/c++/4.0.0/complex:1188:  
error: template with C linkage
/Developer/SDKs/MacOSX10.4u.sdk/usr/include/c++/4.0.0/complex:1333:  
error: template with C linkage
/Developer/SDKs/MacOSX10.4u.sdk/usr/include/c++/4.0.0/complex:1335:  
error: template with C linkage
/Developer/SDKs/MacOSX10.4u.sdk/usr/include/c++/4.0.0/complex:1337:  
error: template with C linkage
/Developer/SDKs/MacOSX10.4u.sdk/usr/include/c++/4.0.0/complex:1339:  
error: template with C linkage
/Developer/SDKs/MacOSX10.4u.sdk/usr/include/c++/4.0.0/complex:1341:  
error: template with C linkage
lipo: can't figure out the architecture type of: /var/folders/jz/ 
jzMQLnV-GOWCP55tPgPBl++++Tc/-Tmp-//cccQ8EWC.out
error: Command "g++ -arch ppc -arch i386 -isysroot /Developer/SDKs/ 
MacOSX10.4u.sdk -fno-strict-aliasing -Wno-long-double -no-cpp-precomp - 
mno-fused-madd -fno-common -dynamic -DNDEBUG -g -O3 -Iscipy/ 
interpolate/src -I/Library/Frameworks/Python.framework/Versions/2.5/ 
lib/python2.5/site-packages/numpy/core/include -I/Library/Frameworks/ 
Python.framework/Versions/2.5/include/python2.5 -c scipy/interpolate/ 
src/_interpolate.cpp -o build/temp.macosx-10.3-ppc-2.5/scipy/ 
interpolate/src/_interpolate.o" failed with exit status 1



More information about the Scipy-dev mailing list