[SciPy-dev] testresults current trunk

josef.pktd@gmai... josef.pktd@gmai...
Tue Nov 17 10:36:40 CST 2009


2 errors 1 failure: anything new or just a consequence of my numpy
test failures ?

Josef

>python -c "import scipy; scipy.test()"
Running unit tests for scipy
NumPy version 1.4.0.dev7746
NumPy is installed in c:\programs\python25\lib\site-packages\numpy
SciPy version 0.8.0.dev6118
SciPy is installed in C:\Josef\_progs\Subversion\scipy-trunk_after\trunk\dist\sc
ipy-0.8.0.dev6118.win32\Programs\Python25\Lib\site-packages\scipy
Python version 2.5.2 (r252:60911, Feb 21 2008, 13:11:45) [MSC v.1310 32 bit (Int
el)]
nose version 0.11.1
nose.config: INFO: Excluding tests matching ['f2py_ext', 'f2py_f90_ext', 'gen_ex
t', 'pyrex_ext', 'swig_ext', 'array_from_pyobj']

ERROR: test_decomp.test_lapack_misaligned(<function solve at 0x01C55AF0>, (array
([[  1.734e-255,   8.189e-217,   4.025e-178,   1.903e-139,   9.344e-101,
----------------------------------------------------------------------
Traceback (most recent call last):
  File "c:\programs\python25\lib\site-packages\nose-0.11.1-py2.5.egg\nose\case.p
y", line 183, in runTest
    self.test(*self.arg)
  File "C:\Josef\_progs\Subversion\scipy-trunk_after\trunk\dist\scipy-0.8.0.dev6
118.win32\Programs\Python25\Lib\site-packages\scipy\linalg\tests\test_decomp.py"
, line 1106, in check_lapack_misaligned
    func(*a,**kwargs)
  File "\Programs\Python25\Lib\site-packages\scipy\linalg\basic.py", line 127, i
n solve
  File "\programs\python25\Lib\site-packages\numpy\lib\function_base.py", line 5
86, in asarray_chkfinite
    raise ValueError, "array must not contain infs or NaNs"
ValueError: array must not contain infs or NaNs

======================================================================
ERROR: test_mpmath.test_expi_complex
----------------------------------------------------------------------
Traceback (most recent call last):
  File "c:\programs\python25\lib\site-packages\nose-0.11.1-py2.5.egg\nose\case.p
y", line 183, in runTest
    self.test(*self.arg)
  File "C:\Josef\_progs\Subversion\numpy-trunk\dist\numpy-1.4.0.dev7746.win32\pr
ograms\python25\Lib\site-packages\numpy\testing\decorators.py", line 143, in ski
pper_func
  File "C:\Josef\_progs\Subversion\scipy-trunk_after\trunk\dist\scipy-0.8.0.dev6
118.win32\Programs\Python25\Lib\site-packages\scipy\special\tests\test_mpmath.py
", line 45, in test_expi_complex
    dataset = np.array(dataset, dtype=np.complex_)
TypeError: a float is required

======================================================================
FAIL: test_lambertw.test_values
----------------------------------------------------------------------
Traceback (most recent call last):
  File "c:\programs\python25\lib\site-packages\nose-0.11.1-py2.5.egg\nose\case.p
y", line 183, in runTest
    self.test(*self.arg)
  File "C:\Josef\_progs\Subversion\scipy-trunk_after\trunk\dist\scipy-0.8.0.dev6
118.win32\Programs\Python25\Lib\site-packages\scipy\special\tests\test_lambertw.
py", line 80, in test_values
    FuncData(w, data, (0,1), 2, rtol=1e-10, atol=1e-13).check()
  File "C:\Josef\_progs\Subversion\scipy-trunk_after\trunk\dist\scipy-0.8.0.dev6
118.win32\Programs\Python25\Lib\site-packages\scipy\special\tests\testutils.py",
 line 187, in check
    assert False, "\n".join(msg)
AssertionError:
Max |adiff|: 2.5797
Max |rdiff|: 3.81511
Bad results for the following points (in output 0):
(-0.44800000000000001+0.40000000000000002j)                              0j => (
-1.2370928928166736-1.6588828572971361j) != (-0.11855133765652383+0.665705343135
83418j)  (rdiff             3.8151122286225245)

----------------------------------------------------------------------
Ran 4245 tests in 71.687s

FAILED (KNOWNFAIL=6, SKIP=33, errors=2, failures=1)


More information about the Scipy-dev mailing list