[SciPy-Dev] request for testing: SciPy 0.7.2 RC1 + NumPy 1.4.1 RC1

Alan G Isaac aisaac@american....
Mon Apr 5 21:57:37 CDT 2010


Python 2.6.5 (32bit) under Vista (64bit).
Alan Isaac

======================================================================
FAIL: test_special_values (test_umath_complex.TestClog)
----------------------------------------------------------------------
Traceback (most recent call last):
   File "C:\Python26\lib\site-packages\numpy\core\tests\test_umath_complex.py", l
ine 179, in test_special_values
     assert_almost_equal(np.log(x), y)
   File "C:\Python26\lib\site-packages\numpy\testing\utils.py", line 437, in asse
rt_almost_equal
     "DESIRED: %s\n" % (str(actual), str(desired)))
AssertionError: Items are not equal:
ACTUAL: [ NaN+2.35619449j]
DESIRED: (inf+2.35619449019j)


----------------------------------------------------------------------
Ran 2334 tests in 14.010s

FAILED (KNOWNFAIL=7, SKIP=1, failures=1)
<nose.result.TextTestResult run=2334 errors=0 failures=1>


More information about the SciPy-Dev mailing list