[SciPy-Dev] [Numpy-discussion] ANN: SciPy 0.11.0 release candidate 1

Ralf Gommers ralf.gommers@gmail....
Wed Aug 8 13:53:08 CDT 2012


On Wed, Aug 8, 2012 at 8:38 PM, Yaroslav Halchenko <lists@onerussian.com>wrote:

> I thought it might be of interest for you -- I have ran nosetests scipy
> against current head on an s390x Debian porter box:
> http://www.onerussian.com/tmp/tests-scipy-v0.4.3-5984-gfd5ceda-s390x.log
> summary:
> FAILED (SKIP=31, errors=15, failures=6)
>
> Thanks Yaroslav.

Note that all the errors disappear if you run the tests with ">>>
scipy.test('full', verbose=2)".

The 6 failures are:

======================================================================
FAIL: test_basic.TestNorm.test_stable
----------------------------------------------------------------------
Traceback (most recent call last):
  File "/usr/lib/python2.7/dist-packages/nose/case.py", line 197, in runTest
    self.test(*self.arg)
  File "/home/yoh/scipy/scipy/install/lib/python2.7/site-packages/scipy/linalg/tests/test_basic.py",
line 585, in test_stable
    assert_almost_equal(norm(a) - 1e4, 0.5)
  File "/usr/lib/pymodules/python2.7/numpy/testing/utils.py", line
468, in assert_almost_equal
    raise AssertionError(msg)
AssertionError:
Arrays are not almost equal to 7 decimals
 ACTUAL: 0.0
 DESIRED: 0.5

======================================================================
FAIL: test_datatypes.test_uint64_max
----------------------------------------------------------------------
Traceback (most recent call last):
  File "/usr/lib/python2.7/dist-packages/nose/case.py", line 197, in runTest
    self.test(*self.arg)
  File "/home/yoh/scipy/scipy/install/lib/python2.7/site-packages/scipy/ndimage/tests/test_datatypes.py",
line 57, in test_uint64_max
    assert_true(x[1] > (2**63))
AssertionError: False is not true

======================================================================
FAIL: test_qhull.TestUtilities.test_degenerate_barycentric_transforms
----------------------------------------------------------------------
Traceback (most recent call last):
  File "/usr/lib/python2.7/dist-packages/nose/case.py", line 197, in runTest
    self.test(*self.arg)
  File "/usr/lib/pymodules/python2.7/numpy/testing/decorators.py",
line 146, in skipper_func
    return f(*args, **kwargs)
  File "/home/yoh/scipy/scipy/install/lib/python2.7/site-packages/scipy/spatial/tests/test_qhull.py",
line 139, in test_degenerate_barycentric_transforms
    assert_(bad_count < 20, bad_count)
  File "/usr/lib/pymodules/python2.7/numpy/testing/utils.py", line 34,
in assert_
    raise AssertionError(msg)
AssertionError: 20

======================================================================
FAIL: test_qhull.TestUtilities.test_more_barycentric_transforms
----------------------------------------------------------------------
Traceback (most recent call last):
  File "/usr/lib/python2.7/dist-packages/nose/case.py", line 197, in runTest
    self.test(*self.arg)
  File "/usr/lib/pymodules/python2.7/numpy/testing/decorators.py",
line 146, in skipper_func
    return f(*args, **kwargs)
  File "/home/yoh/scipy/scipy/install/lib/python2.7/site-packages/scipy/spatial/tests/test_qhull.py",
line 199, in test_more_barycentric_transforms
    unit_cube_tol=1.5e6*eps)
  File "/home/yoh/scipy/scipy/install/lib/python2.7/site-packages/scipy/spatial/tests/test_qhull.py",
line 124, in _check_barycentric_transforms
    assert_(ok.all(), "%s %s" % (err_msg, np.where(~ok)))
  File "/usr/lib/pymodules/python2.7/numpy/testing/utils.py", line 34,
in assert_
    raise AssertionError(msg)
AssertionError: ndim=4 (array([ 8071, 10512, 10513]),)

======================================================================
FAIL: test_iv_cephes_vs_amos_mass_test (test_basic.TestBessel)
----------------------------------------------------------------------
Traceback (most recent call last):
  File "/home/yoh/scipy/scipy/install/lib/python2.7/site-packages/scipy/special/tests/test_basic.py",
line 1659, in test_iv_cephes_vs_amos_mass_test
    assert_(dc[k] < 1e-9, (v[k], x[k], special.iv(v[k], x[k]),
special.iv(v[k], x[k]+0j)))
  File "/usr/lib/pymodules/python2.7/numpy/testing/utils.py", line 34,
in assert_
    raise AssertionError(msg)
AssertionError: (189.2947429454936, 3.0238805556481037,
4.089165443940765e-317, 0j)

======================================================================
FAIL: test_data.test_boost(<Data for gamma: test_gamma_data_ipp-near_m55>,)
----------------------------------------------------------------------
Traceback (most recent call last):
  File "/usr/lib/python2.7/dist-packages/nose/case.py", line 197, in runTest
    self.test(*self.arg)
  File "/home/yoh/scipy/scipy/install/lib/python2.7/site-packages/scipy/special/tests/test_data.py",
line 218, in _test_factory
    test.check(dtype=dtype)
  File "/home/yoh/scipy/scipy/install/lib/python2.7/site-packages/scipy/special/_testutils.py",
line 224, in check
    assert_(False, "\n".join(msg))
  File "/usr/lib/pymodules/python2.7/numpy/testing/utils.py", line 34,
in assert_
    raise AssertionError(msg)
AssertionError:
Max |adiff|: 5.56451e-80
Max |rdiff|: 6.01399e-12
Bad results for the following points (in output 0):
                        -55.25 =>         1.2813426521432485e-73 !=
     1.2813426521356121e-73  (rdiff          5.959647207094304e-12)
                      -55.0625 =>          9.867326074925447e-73 !=
       9.86732607487198e-73  (rdiff         5.4185128296701245e-12)
                    -55.015625 =>          4.736069454765531e-72 !=
      4.736069454740001e-72  (rdiff          5.390477071035947e-12)
                 -55.001953125 =>          4.001152702605484e-71 !=
     4.0011527025839184e-71  (rdiff         5.3899101047365405e-12)
                -55.0009765625 =>           8.03371657917631e-71 !=
      8.033716579133006e-71  (rdiff          5.390260882973932e-12)
            -55.00006103515625 =>         1.2901278999535244e-69 !=
     1.2901278999465708e-69  (rdiff          5.389836286790528e-12)
            -55.00001525878906 =>          5.161460448793591e-69 !=
      5.161460448765773e-69  (rdiff          5.389643299825182e-12)
            -55.00000762939453 =>         1.0323237221382923e-68 !=
     1.0323237221327282e-68  (rdiff         5.3898770611534905e-12)
            -54.99999237060547 =>        -1.0323869903952338e-68 !=
    -1.0323869903896693e-68  (rdiff          5.389945636678977e-12)
           -54.999969482421875 =>        -2.5812047538146166e-69 !=
     -2.581204753800704e-69  (rdiff          5.390048438554985e-12)
              -54.999755859375 =>         -3.229275765714629e-70 !=
     -3.229275765697224e-70  (rdiff           5.38980884948699e-12)
               -54.99951171875 =>        -1.6162223904478387e-70 !=
    -1.6162223904391274e-70  (rdiff          5.389899375642087e-12)
                 -54.998046875 =>        -4.0644220032500644e-71 !=
     -4.064422003228156e-71  (rdiff          5.390308306297719e-12)
                   -54.9921875 =>        -1.0403990765960148e-71 !=
     -1.040399076590406e-71  (rdiff          5.391034204122906e-12)
                    -54.984375 =>         -5.369420317853762e-72 !=
     -5.369420317824802e-72  (rdiff          5.393513012257176e-12)
                      -54.9375 =>        -1.6301847489550236e-72 !=
    -1.6301847489461702e-72  (rdiff          5.430916285207302e-12)
                       -54.875 =>        -1.0680846658730133e-72 !=
    -1.0680846658670925e-72  (rdiff         5.5434016349406124e-12)
                       -54.875 =>        -1.0680846658730133e-72 !=
    -1.0680846658670925e-72  (rdiff         5.5434016349406124e-12)
                        -54.75 =>         -9.545836185682586e-73 !=
     -9.545836185625178e-73  (rdiff          6.013992626968188e-12)
                       -54.625 =>         -1.206186475654961e-72 !=
    -1.2061864756493961e-72  (rdiff         4.6135414163673135e-12)

----------------------------------------------------------------------
Ran 6217 tests in 500.388s
-------------- next part --------------
An HTML attachment was scrubbed...
URL: http://mail.scipy.org/pipermail/scipy-dev/attachments/20120808/6900dcc5/attachment-0001.html 


More information about the SciPy-Dev mailing list