[Scipy-tickets] [SciPy] #678: scipy.test failure with mkl/cdft

SciPy Trac scipy-tickets@scipy....
Fri Jul 9 19:02:07 CDT 2010


#678: scipy.test failure with mkl/cdft
-----------------------+----------------------------------------------------
 Reporter:  dstuebe    |       Owner:  cdavid     
     Type:  defect     |      Status:  accepted   
 Priority:  normal     |   Milestone:  Unscheduled
Component:  scipy.lib  |     Version:             
 Keywords:             |  
-----------------------+----------------------------------------------------

Comment(by cjgohlke):

 I am seeing the same ODR test failures using scipy 0.8rc1 linked against
 MKL 10.2.5.1 on Windows.

 {{{
 Running unit tests for scipy.odr
 NumPy version 1.4.1
 NumPy is installed in X:\Python26\lib\site-packages\numpy
 SciPy version 0.8.0rc1
 SciPy is installed in X:\Python26\lib\site-packages\scipy
 Python version 2.6.5 (r265:79096, Mar 19 2010, 21:48:26) [MSC v.1500 32
 bit (Int
 el)]
 nose version 0.11.3
 ..FFF
 ======================================================================
 FAIL: test_lorentz (test_odr.TestODR)
 ----------------------------------------------------------------------
 Traceback (most recent call last):
   File "X:\Python26\lib\site-packages\scipy\odr\tests\test_odr.py", line
 292, in
  test_lorentz
     3.7798193600109009e+00]),
   File "X:\Python26\lib\site-packages\numpy\testing\utils.py", line 765,
 in asse
 rt_array_almost_equal
     header='Arrays are not almost equal')
   File "X:\Python26\lib\site-packages\numpy\testing\utils.py", line 609,
 in asse
 rt_array_compare
     raise AssertionError(msg)
 AssertionError:
 Arrays are not almost equal

 (mismatch 100.0%)
  x: array([  1.00000000e+03,   1.00000000e-01,   3.80000000e+00])
  y: array([  1.43067808e+03,   1.33905090e-01,   3.77981936e+00])

 ======================================================================
 FAIL: test_multi (test_odr.TestODR)
 ----------------------------------------------------------------------
 Traceback (most recent call last):
   File "X:\Python26\lib\site-packages\scipy\odr\tests\test_odr.py", line
 188, in
  test_multi
     0.5101147161764654,  0.5173902330489161]),
   File "X:\Python26\lib\site-packages\numpy\testing\utils.py", line 765,
 in asse
 rt_array_almost_equal
     header='Arrays are not almost equal')
   File "X:\Python26\lib\site-packages\numpy\testing\utils.py", line 609,
 in asse
 rt_array_compare
     raise AssertionError(msg)
 AssertionError:
 Arrays are not almost equal

 (mismatch 100.0%)
  x: array([ 4. ,  2. ,  7. ,  0.4,  0.5])
  y: array([ 4.37998803,  2.43330576,  8.00288459,  0.51011472,
 0.51739023])

 ======================================================================
 FAIL: test_pearson (test_odr.TestODR)
 ----------------------------------------------------------------------
 Traceback (most recent call last):
   File "X:\Python26\lib\site-packages\scipy\odr\tests\test_odr.py", line
 235, in
  test_pearson
     np.array([ 5.4767400299231674, -0.4796082367610305]),
   File "X:\Python26\lib\site-packages\numpy\testing\utils.py", line 765,
 in asse
 rt_array_almost_equal
     header='Arrays are not almost equal')
   File "X:\Python26\lib\site-packages\numpy\testing\utils.py", line 609,
 in asse
 rt_array_compare
     raise AssertionError(msg)
 AssertionError:
 Arrays are not almost equal

 (mismatch 100.0%)
  x: array([ 1.,  1.])
  y: array([ 5.47674003, -0.47960824])

 ----------------------------------------------------------------------
 Ran 5 tests in 0.166s

 FAILED (failures=3)
 }}}

-- 
Ticket URL: <http://projects.scipy.org/scipy/ticket/678#comment:3>
SciPy <http://www.scipy.org>
SciPy is open-source software for mathematics, science, and engineering.


More information about the Scipy-tickets mailing list