[SciPy-user] FAIL: check_lpmn (scipy.special.basic.test_basic.test_lpmn)

Nils Wagner nwagner at mecha.uni-stuttgart.de
Fri Aug 6 01:22:46 CDT 2004


scipy.test() with latest cvs

======================================================================
FAIL: check_lpmn (scipy.special.basic.test_basic.test_lpmn)
----------------------------------------------------------------------
Traceback (most recent call last):
   File 
"/usr/lib/python2.3/site-packages/scipy/special/tests/test_basic.py", 
line 1625, in check_lpmn
     1.50000]])),4)
   File "/usr/lib/python2.3/site-packages/scipy_test/testing.py", line 
681, in assert_array_almost_equal
     assert cond,\
AssertionError:
Arrays are not almost equal (mismatch 66.6666666667%):
         Array 1: [[  [ 1.  0.  0.]]
  [  [ 0.  0.  0.]]]
         Array 2: [[  [ 1.     0.5   -0.125]]
  [  [ 0.     1.     1.5  ]]]


----------------------------------------------------------------------
Ran 936 tests in 2.826s

FAILED (failures=1)



More information about the SciPy-user mailing list