[SciPy-user] output of failed test

matt matt at hotdispatch.com
Fri Jul 16 14:46:54 CDT 2004


I get a failure when I run scipy.test() but I don't really know what  
the output means or how to fix it.  Any help would be appreciated.

-Matt B


gnuplot: not found
    !! No test file 'test_Mplot.py' found for <module 'scipy.xplt.Mplot'  
from '...-packages/scipy/xplt/Mplot.pyc'>
    !! No test file 'test_build_py.py' found for <module  
'scipy_distutils.command.build_py' from  
'...distutils/command/build_py.pyc'>
    !! No test file 'test_gistC.py' found for <module 'scipy.xplt.gistC'  
from '...e-packages/scipy/xplt/gistC.so'>
   Found 4 tests for scipy.io.array_import
   Found 23 tests for scipy_base.function_base
    !! No test file 'test_ltisys.py' found for <module  
'scipy.signal.ltisys' from '...ckages/scipy/signal/ltisys.pyc'>
    !! No test file 'test_info_integrate.py' found for <module  
'scipy.integrate.info_integrate' from  
'...y/integrate/info_integrate.pyc'>
    !! No test file 'test___init__.py' found for <module 'scipy.xxx.yyy'  
from '...ges/scipy/xxx/yyy/__init__.pyc'>
    !! No test file 'test_vq.py' found for <module 'scipy.cluster.vq'  
from '...-packages/scipy/cluster/vq.pyc'>
    !! No test file 'test___init__.py' found for <module 'scipy.xxx'  
from '...ackages/scipy/xxx/__init__.pyc'>
    !! No test file 'test_ccompiler.py' found for <module  
'scipy_distutils.ccompiler' from '.../scipy_distutils/ccompiler.pyc'>
    !! No test file 'test_info_interpolate.py' found for <module  
'scipy.interpolate.info_interpolate' from  
'...terpolate/info_interpolate.pyc'>
    !! No test file 'test_gist.py' found for <module 'scipy.xplt.gist'  
from '...e-packages/scipy/xplt/gist.pyc'>
    !! No test file 'test___cvs_version__.py' found for <module  
'scipy.linalg.__cvs_version__' from  
'...ipy/linalg/__cvs_version__.pyc'>
    !! No test file 'test_info_cow.py' found for <module  
'scipy.cow.info_cow' from '...ackages/scipy/cow/info_cow.pyc'>
    !! No test file 'test_spam.py' found for <module 'scipy.xxx.spam'  
from '...ite-packages/scipy/xxx/spam.so'>
    !! No test file 'test_write_style.py' found for <module  
'scipy.xplt.write_style' from '...ges/scipy/xplt/write_style.pyc'>
    !! No test file 'test_info_gplt.py' found for <module  
'scipy.gplt.info_gplt' from '...kages/scipy/gplt/info_gplt.pyc'>
    !! No test file 'test_tree.py' found for <module 'scipy.ga.tree'  
from '...ite-packages/scipy/ga/tree.pyc'>
   Found 92 tests for scipy.stats.stats
    !! No test file 'test_config_compiler.py' found for <module  
'scipy_distutils.command.config_compiler' from  
'...ls/command/config_compiler.pyc'>
    !! No test file 'test_quadrature.py' found for <module  
'scipy.integrate.quadrature' from '...scipy/integrate/quadrature.pyc'>
    !! No test file 'test___init__.py' found for <module 'scipy.cow'  
from '...ackages/scipy/cow/__init__.pyc'>
   Found 20 tests for scipy.fftpack.pseudo_diffs
    !! No test file 'test_sigtools.py' found for <module  
'scipy.signal.sigtools' from '...kages/scipy/signal/sigtools.so'>
    !! No test file 'test_optimize.py' found for <module  
'scipy.optimize.optimize' from '...es/scipy/optimize/optimize.pyc'>
    !! No test file 'test_colorbar.py' found for <module  
'scipy.xplt.colorbar' from '...ckages/scipy/xplt/colorbar.pyc'>
    !! No test file 'test_scipy_test_version.py' found for <module  
'scipy_test.scipy_test_version' from  
'...py_test/scipy_test_version.pyc'>
    !! No test file 'test_plwf.py' found for <module 'scipy.xplt.plwf'  
from '...e-packages/scipy/xplt/plwf.pyc'>
    !! No test file 'test_build_clib.py' found for <module  
'scipy_distutils.command.build_clib' from  
'...stutils/command/build_clib.pyc'>
    !! No test file 'test_specfun.py' found for <module  
'scipy.special.specfun' from '...kages/scipy/special/specfun.so'>
    !! No test file 'test__compiled_base.py' found for <module  
'scipy_base._compiled_base' from '...s/scipy_base/_compiled_base.so'>
    !! No test file 'test_dumb_shelve.py' found for <module  
'scipy.io.dumb_shelve' from '...kages/scipy/io/dumb_shelve.pyc'>
    !! No test file 'test___init__.py' found for <module  
'scipy_distutils.command' from '...distutils/command/__init__.pyc'>
    !! No test file 'test_shapetest.py' found for <module  
'scipy.xplt.shapetest' from '...kages/scipy/xplt/shapetest.pyc'>
    !! No test file 'test__fftpack.py' found for <module  
'scipy.fftpack._fftpack' from '...ages/scipy/fftpack/_fftpack.so'>
   Found 5 tests for scipy.interpolate.fitpack
    !! No test file 'test___cvs_version__.py' found for <module  
'scipy.special.__cvs_version__' from  
'...py/special/__cvs_version__.pyc'>
    !! No test file 'test_info_io.py' found for <module  
'scipy.io.info_io' from '...-packages/scipy/io/info_io.pyc'>
    !! No test file 'test___init__.py' found for <module  
'scipy.interpolate' from '...scipy/interpolate/__init__.pyc'>
    !! No test file 'test__zeros.py' found for <module  
'scipy.optimize._zeros' from '...kages/scipy/optimize/_zeros.so'>
    !! No test file 'test_futil.py' found for <module  
'scipy.stats.futil' from '...-packages/scipy/stats/futil.so'>
    !! No test file 'test___cvs_version__.py' found for <module  
'scipy.fftpack.__cvs_version__' from  
'...py/fftpack/__cvs_version__.pyc'>
   Found 2 tests for scipy_base.fastumath
    !! No test file 'test_waveforms.py' found for <module  
'scipy.signal.waveforms' from '...ges/scipy/signal/waveforms.pyc'>
    !! No test file 'test___init__.py' found for <module 'scipy' from  
'...te-packages/scipy/__init__.pyc'>
    !! No test file 'test_convolve.py' found for <module  
'scipy.fftpack.convolve' from '...ages/scipy/fftpack/convolve.so'>
    !! FAILURE importing tests for  <module 'scipy.linalg.lapack' from  
'...ckages/scipy/linalg/lapack.pyc'>
     /usr/local/lib/python2.3/site-packages/scipy/linalg/lapack.py:15:  
ImportError: /usr/local/lib/libptf77blas.so.1: Undefined symbol  
"ATL_sptgemm" (in ?)
    !! No test file 'test_ga_list.py' found for <module  
'scipy.ga.ga_list' from '...-packages/scipy/ga/ga_list.pyc'>
    !! No test file 'test_special_version.py' found for <module  
'scipy.special.special_version' from  
'...py/special/special_version.pyc'>
   Found 19 tests for scipy.fftpack.basic
    !! No test file 'test_anneal.py' found for <module  
'scipy.optimize.anneal' from '...ages/scipy/optimize/anneal.pyc'>
    !! No test file 'test_fitpack2.py' found for <module  
'scipy.interpolate.fitpack2' from '...scipy/interpolate/fitpack2.pyc'>
    !! No test file 'test_gene.py' found for <module 'scipy.ga.gene'  
from '...ite-packages/scipy/ga/gene.pyc'>
    !! No test file 'test___init__.py' found for <module 'scipy.signal'  
from '...ages/scipy/signal/__init__.pyc'>
    !! No test file 'test_info_plt.py' found for <module  
'scipy.plt.info_plt' from '...ackages/scipy/plt/info_plt.pyc'>
    !! No test file 'test_numpyio.py' found for <module  
'scipy.io.numpyio' from '...e-packages/scipy/io/numpyio.so'>
    !! No test file 'test_extension.py' found for <module  
'scipy_distutils.extension' from '.../scipy_distutils/extension.pyc'>
    !! No test file 'test_data_store.py' found for <module  
'scipy.io.data_store' from '...ckages/scipy/io/data_store.pyc'>
    !! No test file 'test_slice3.py' found for <module  
'scipy.xplt.slice3' from '...packages/scipy/xplt/slice3.pyc'>
    !! No test file 'test_scipy_base_version.py' found for <module  
'scipy_base.scipy_base_version' from  
'...py_base/scipy_base_version.pyc'>
    !! No test file 'test_algorithm.py' found for <module  
'scipy.ga.algorithm' from '...ackages/scipy/ga/algorithm.pyc'>
    !! FAILURE importing tests for  <module 'scipy.optimize.zeros' from  
'...kages/scipy/optimize/zeros.pyc'>
     /usr/local/lib/python2.3/site-packages/scipy/optimize/lbfgsb.py:28:  
ImportError: /usr/local/lib/libptf77blas.so.1: Undefined symbol  
"ATL_sptgemm" (in ?)
    !! No test file 'test_info_xplt.py' found for <module  
'scipy.xplt.info_xplt' from '...kages/scipy/xplt/info_xplt.pyc'>
    !! No test file 'test___init__.py' found for <module 'scipy.stats'  
from '...kages/scipy/stats/__init__.pyc'>
    !! No test file 'test_pyPlot.py' found for <module  
'scipy.gplt.pyPlot' from '...packages/scipy/gplt/pyPlot.pyc'>
    !! No test file 'test_info_cluster.py' found for <module  
'scipy.cluster.info_cluster' from '...scipy/cluster/info_cluster.pyc'>
    !! No test file 'test_mio.py' found for <module 'scipy.io.mio' from  
'...site-packages/scipy/io/mio.pyc'>
    !! No test file 'test_install_data.py' found for <module  
'scipy_distutils.command.install_data' from  
'...utils/command/install_data.pyc'>
    !! No test file 'test___init__.py' found for <module 'scipy.cluster'  
from '...ges/scipy/cluster/__init__.pyc'>
   Found 4 tests for scipy_base.index_tricks
    !! No test file 'test_selection.py' found for <module  
'scipy.ga.selection' from '...ackages/scipy/ga/selection.pyc'>
    !! No test file 'test_fftpack_version.py' found for <module  
'scipy.fftpack.fftpack_version' from  
'...py/fftpack/fftpack_version.pyc'>
    !! No test file 'test___cvs_version__.py' found for <module  
'scipy_base.__cvs_version__' from '...scipy_base/__cvs_version__.pyc'>
    !! No test file 'test_movie.py' found for <module 'scipy.xplt.movie'  
from '...-packages/scipy/xplt/movie.pyc'>
    !! No test file 'test___init__.py' found for <module 'scipy.xplt'  
from '...ckages/scipy/xplt/__init__.pyc'>
    !! No test file 'test_scaling.py' found for <module  
'scipy.ga.scaling' from '...-packages/scipy/ga/scaling.pyc'>
    !! FAILURE importing tests for  <module 'scipy.linalg.basic' from  
'...ackages/scipy/linalg/basic.pyc'>
      
/usr/local/lib/python2.3/site-packages/scipy/linalg/tests/ 
test_basic.py:28: ImportError: cannot import name solve (in ?)
    !! No test file 'test_odepack.py' found for <module  
'scipy.integrate.odepack' from '...es/scipy/integrate/odepack.pyc'>
    !! No test file 'test_exec_command.py' found for <module  
'scipy_distutils.exec_command' from  
'...ipy_distutils/exec_command.pyc'>
    !! No test file 'test_common_routines.py' found for <module  
'scipy.optimize.common_routines' from  
'...y/optimize/common_routines.pyc'>
    !! No test file 'test_interpolate.py' found for <module  
'scipy.interpolate.interpolate' from  
'...py/interpolate/interpolate.pyc'>
    !! No test file 'test___cvs_version__.py' found for <module  
'scipy_distutils.__cvs_version__' from  
'..._distutils/__cvs_version__.pyc'>
    !! No test file 'test_wxplt.py' found for <module 'scipy.plt.wxplt'  
from '...e-packages/scipy/plt/wxplt.pyc'>
    !! No test file 'test_lbfgsb.py' found for <module  
'scipy.optimize.lbfgsb' from '...ages/scipy/optimize/lbfgsb.pyc'>
    !! No test file 'test_language.py' found for <module  
'scipy.ga.language' from '...packages/scipy/ga/language.pyc'>
    !! No test file 'test_info_xxx.py' found for <module  
'scipy.xxx.info_xxx' from '...ackages/scipy/xxx/info_xxx.pyc'>
   Found 43 tests for scipy_base.shape_base
    !! No test file 'test_linalg_version.py' found for <module  
'scipy.linalg.linalg_version' from '...cipy/linalg/linalg_version.pyc'>
    !! No test file 'test___init__.py' found for <module 'scipy.plt'  
from '...ackages/scipy/plt/__init__.pyc'>
   Found 9 tests for scipy_base.matrix_base
    !! No test file 'test_machar.py' found for <module  
'scipy_base.machar' from '...packages/scipy_base/machar.pyc'>
    !! No test file 'test_log.py' found for <module  
'scipy_distutils.log' from '...ckages/scipy_distutils/log.pyc'>
    !! No test file 'test_info_scipy_base.py' found for <module  
'scipy_base.info_scipy_base' from '...scipy_base/info_scipy_base.pyc'>
   Found 342 tests for scipy.special.basic
    !! No test file 'test_unixccompiler.py' found for <module  
'scipy_distutils.unixccompiler' from  
'...py_distutils/unixccompiler.pyc'>
    !! No test file 'test__minpack.py' found for <module  
'scipy.optimize._minpack' from '...ges/scipy/optimize/_minpack.so'>
    !! No test file 'test_interface.py' found for <module  
'scipy.gplt.interface' from '...kages/scipy/gplt/interface.pyc'>
    !! No test file 'test_scimath.py' found for <module  
'scipy_base.scimath' from '...ackages/scipy_base/scimath.pyc'>
    !! No test file 'test_new_plot.py' found for <module  
'scipy.gplt.new_plot' from '...ckages/scipy/gplt/new_plot.pyc'>
    !! No test file 'test___init__.py' found for <module  
'scipy_distutils' from '...s/scipy_distutils/__init__.pyc'>
    !! No test file 'test___init__.py' found for <module 'scipy_test'  
from '...ckages/scipy_test/__init__.pyc'>
    !! No test file 'test_build.py' found for <module  
'scipy_distutils.command.build' from  
'...py_distutils/command/build.pyc'>
    !! No test file 'test___init__.py' found for <module 'scipy.fftpack'  
from '...ges/scipy/fftpack/__init__.pyc'>
    !! No test file 'test_scipy_distutils_version.py' found for <module  
'scipy_distutils.scipy_distutils_version' from  
'...ls/scipy_distutils_version.pyc'>
    !! No test file 'test___init__.py' found for <module 'scipy.gplt'  
from '...ckages/scipy/gplt/__init__.pyc'>
    !! No test file 'test_info_signal.py' found for <module  
'scipy.signal.info_signal' from '...s/scipy/signal/info_signal.pyc'>
    !! No test file 'test_sync_cluster.py' found for <module  
'scipy.cow.sync_cluster' from '...ges/scipy/cow/sync_cluster.pyc'>
    !! No test file 'test_bsplines.py' found for <module  
'scipy.signal.bsplines' from '...ages/scipy/signal/bsplines.pyc'>
    !! No test file 'test___init__.py' found for <module 'scipy_base'  
from '...ckages/scipy_base/__init__.pyc'>
    !! No test file 'test_yorick.py' found for <module  
'scipy.xplt.yorick' from '...packages/scipy/xplt/yorick.pyc'>
    !! No test file 'test_testing.py' found for <module  
'scipy_test.testing' from '...ackages/scipy_test/testing.pyc'>
    !! No test file 'test_scipy_version.py' found for <module  
'scipy.scipy_version' from '...ckages/scipy/scipy_version.pyc'>
    !! No test file 'test_info_fftpack.py' found for <module  
'scipy.fftpack.info_fftpack' from '...scipy/fftpack/info_fftpack.pyc'>
    !! No test file 'test_info_linalg.py' found for <module  
'scipy.linalg.info_linalg' from '...s/scipy/linalg/info_linalg.pyc'>
    !! No test file 'test_build_src.py' found for <module  
'scipy_distutils.command.build_src' from  
'...istutils/command/build_src.pyc'>
    !! No test file 'test_pexec.py' found for <module 'scipy_base.pexec'  
from '...-packages/scipy_base/pexec.pyc'>
    !! No test file 'test_population.py' found for <module  
'scipy.ga.population' from '...ckages/scipy/ga/population.pyc'>
    !! No test file 'test_cephes.py' found for <module  
'scipy.special.cephes' from '...ckages/scipy/special/cephes.so'>
    !! No test file 'test_helpmod.py' found for <module 'scipy.helpmod'  
from '...ite-packages/scipy/helpmod.pyc'>
    !! No test file 'test__support.py' found for <module  
'scipy.stats._support' from '...kages/scipy/stats/_support.pyc'>
   Found 39 tests for scipy_base.type_check
   Found 2 tests for scipy_base.limits
    !! No test file 'test_filter_design.py' found for <module  
'scipy.signal.filter_design' from '...scipy/signal/filter_design.pyc'>
   Found 10 tests for scipy.stats.morestats
    !! No test file 'test_ga_util.py' found for <module  
'scipy.ga.ga_util' from '...-packages/scipy/ga/ga_util.pyc'>
    !! No test file 'test_genome.py' found for <module 'scipy.ga.genome'  
from '...e-packages/scipy/ga/genome.pyc'>
    !! No test file 'test_Sparse.py' found for <module  
'scipy.sparse.Sparse' from '...ckages/scipy/sparse/Sparse.pyc'>
    !! No test file 'test_install.py' found for <module  
'scipy_distutils.command.install' from  
'..._distutils/command/install.pyc'>
    !! No test file 'test_common_routines.py' found for <module  
'scipy.interpolate.common_routines' from  
'...nterpolate/common_routines.pyc'>
    !! No test file 'test_dist.py' found for <module  
'scipy_distutils.dist' from '...kages/scipy_distutils/dist.pyc'>
    !! No test file 'test___init__.py' found for <module 'scipy.io' from  
'...packages/scipy/io/__init__.pyc'>
    !! No test file 'test_pl3d.py' found for <module 'scipy.xplt.pl3d'  
from '...e-packages/scipy/xplt/pl3d.pyc'>
    !! No test file 'test_info_special.py' found for <module  
'scipy.special.info_special' from '...scipy/special/info_special.pyc'>
    !! No test file 'test___init__.py' found for <module  
'scipy.integrate' from '...s/scipy/integrate/__init__.pyc'>
    !! No test file 'test___cvs_version__.py' found for <module  
'scipy_test.__cvs_version__' from '...scipy_test/__cvs_version__.pyc'>
    !! No test file 'test_rv.py' found for <module 'scipy.stats.rv' from  
'...te-packages/scipy/stats/rv.pyc'>
    !! No test file 'test_tree_opt.py' found for <module  
'scipy.ga.tree_opt' from '...packages/scipy/ga/tree_opt.pyc'>
    !! No test file 'test_minpack.py' found for <module  
'scipy.optimize.minpack' from '...ges/scipy/optimize/minpack.pyc'>
    !! No test file 'test_spline.py' found for <module  
'scipy.signal.spline' from '...ackages/scipy/signal/spline.so'>
    !! No test file 'test___init__.py' found for <module 'scipy.ga' from  
'...packages/scipy/ga/__init__.pyc'>
   Found 2 tests for scipy.xxx.foo
    !! No test file 'test_pilutil.py' found for <module 'scipy.pilutil'  
from '...ite-packages/scipy/pilutil.pyc'>
    !! No test file 'test__fitpack.py' found for <module  
'scipy.interpolate._fitpack' from '.../scipy/interpolate/_fitpack.so'>
    !! No test file 'test_orthogonal.py' found for <module  
'scipy.special.orthogonal' from '...s/scipy/special/orthogonal.pyc'>
    !! No test file 'test_dfitpack.py' found for <module  
'scipy.interpolate.dfitpack' from '.../scipy/interpolate/dfitpack.so'>
    !! No test file 'test_core.py' found for <module  
'scipy_distutils.core' from '...kages/scipy_distutils/core.pyc'>
    !! No test file 'test___init__.py' found for <module 'scipy.linalg'  
from '...ages/scipy/linalg/__init__.pyc'>
   Found 70 tests for scipy.stats.distributions
    !! No test file 'test_rand.py' found for <module 'scipy.stats.rand'  
from '...e-packages/scipy/stats/rand.so'>
    !! No test file 'test___cvs_version__.py' found for <module  
'scipy.__cvs_version__' from '...ages/scipy/__cvs_version__.pyc'>
    !! No test file 'test_info_stats.py' found for <module  
'scipy.stats.info_stats' from '...ges/scipy/stats/info_stats.pyc'>
    !! No test file 'test___init__.py' found for <module  
'scipy.optimize' from '...es/scipy/optimize/__init__.pyc'>
    !! No test file 'test_sdist.py' found for <module  
'scipy_distutils.command.sdist' from  
'...py_distutils/command/sdist.pyc'>
    !! No test file 'test_info_sparse.py' found for <module  
'scipy.sparse.info_sparse' from '...s/scipy/sparse/info_sparse.pyc'>
    !! No test file 'test_statlib.py' found for <module  
'scipy.stats.statlib' from '...ackages/scipy/stats/statlib.so'>
    !! No test file 'test___init__.py' found for <module 'scipy.sparse'  
from '...ages/scipy/sparse/__init__.pyc'>
   Found 4 tests for scipy.fftpack.helper
    !! No test file 'test_info_optimize.py' found for <module  
'scipy.optimize.info_optimize' from  
'...ipy/optimize/info_optimize.pyc'>
    !! No test file 'test_pickler.py' found for <module  
'scipy.io.pickler' from '...-packages/scipy/io/pickler.pyc'>
    !! No test file 'test_line_endings.py' found for <module  
'scipy_distutils.line_endings' from  
'...ipy_distutils/line_endings.pyc'>
    !! No test file 'test_install_headers.py' found for <module  
'scipy_distutils.command.install_headers' from  
'...ls/command/install_headers.pyc'>
    !! No test file 'test_polynomial.py' found for <module  
'scipy_base.polynomial' from '...ages/scipy_base/polynomial.pyc'>
    !! No test file 'test___init__.py' found for <module 'scipy.special'  
from '...ges/scipy/special/__init__.pyc'>
    !! No test file 'test_ppimport.py' found for <module  
'scipy_base.ppimport' from '...ckages/scipy_base/ppimport.pyc'>
    !! No test file 'test_misc_util.py' found for <module  
'scipy_distutils.misc_util' from '.../scipy_distutils/misc_util.pyc'>
    !! No test file 'test_cow.py' found for <module 'scipy.cow.cow' from  
'...ite-packages/scipy/cow/cow.pyc'>
    !! No test file 'test_build_ext.py' found for <module  
'scipy_distutils.command.build_ext' from  
'...istutils/command/build_ext.pyc'>
   Found 3 tests for scipy.signal.signaltools
   Found 0 tests for __main__

Don't worry about a warning regarding the number of bytes read.
Warning: 1000000 bytes requested, 20 bytes read.
........................................................................ 
.................................................................../ 
usr/local/lib/python2.3/site-packages/scipy/interpolate/fitpack2.py: 
412: UserWarning:
The coefficients of the spline returned have been computed as the
minimal norm least-squares solution of a (numerically) rank deficient
system (deficiency=7). If deficiency is large, the results may be
inaccurate. Deficiency may strongly depend on the value of eps.
   warnings.warn(message)
........................................................................ 
...............E........................................................ 
........................................................................ 
........................................................EEEE............ 
.....................Gegenbauer, a =  2.35311427589
E......EE....................E..........................EEE............. 
..............Eshifted jacobi p,q =  4.0980264312 3.69358970804
EE.....................................................................T 
ies preclude use of exact statistic.
..Ties preclude use of exact statistic.
..................Testing alpha
.Testing anglit
.Testing arcsine
..Testing beta
.Testing betaprime
..Testing bradford
.Testing burr
.Testing cauchy
.Testing chi
.Testing chi2
.Testing dgamma
..Testing dweibull
.Testing erlang
.Testing expon
.Testing exponpow
.Testing exponweib
.Testing f
.Testing fatiguelife
.Testing fisk
.Testing foldcauchy
.Testing foldnorm
.Testing frechet_l
.Testing frechet_r
.Testing gamma
.Testing genextreme
.Testing gengamma
.Testing genhalflogistic
.Testing genlogistic
.Testing genpareto
..Testing gilbrat
.Testing gompertz
.Testing gumbel_l
.Testing gumbel_r
.Testing halfcauchy
.Testing halflogistic
.Testing halfnorm
..Testing hypsecant
.Testing laplace
.Testing loggamma
.Testing logistic
.Testing lognorm
..Testing lomax
.Testing maxwell
.Testing nakagami
..Testing ncf
.Testing nct
.Testing ncx2
.Testing norm
.Testing pareto
..Testing powerlaw
....Testing rayleigh
.Testing reciprocal
.Testing t
.Testing triang
.Testing tukeylambda
.Testing uniform
.Testing weibull_max
.Testing weibull_min
.........
======================================================================
ERROR: check_assoc_laguerre  
(scipy.special.basic.test_basic.test_assoc_laguerre)
----------------------------------------------------------------------
Traceback (most recent call last):
   File  
"/usr/local/lib/python2.3/site-packages/scipy/special/tests/ 
test_basic.py", line 532, in check_assoc_laguerre
     a1 = genlaguerre(11,1)
   File  
"/usr/local/lib/python2.3/site-packages/scipy/special/orthogonal.py",  
line 267, in genlaguerre
     x,w,mu0 = la_roots(n1,alpha,mu=1)
   File  
"/usr/local/lib/python2.3/site-packages/scipy/special/orthogonal.py",  
line 251, in la_roots
     val = gen_roots_and_weights(n,an_La,sbn_La,mu0)
   File  
"/usr/local/lib/python2.3/site-packages/scipy/special/orthogonal.py",  
line 121, in gen_roots_and_weights
     eig = get_eig_func()
   File  
"/usr/local/lib/python2.3/site-packages/scipy/special/orthogonal.py",  
line 91, in get_eig_func
     eig = scipy.linalg.eig
AttributeError: 'module' object has no attribute 'eig'

======================================================================
ERROR: check_chebyc (scipy.special.basic.test_basic.test_chebyc)
----------------------------------------------------------------------
Traceback (most recent call last):
   File  
"/usr/local/lib/python2.3/site-packages/scipy/special/tests/ 
test_basic.py", line 675, in check_chebyc
     C0 = chebyc(0)
   File  
"/usr/local/lib/python2.3/site-packages/scipy/special/orthogonal.py",  
line 470, in chebyc
     x,w,mu0 = c_roots(n1,mu=1)
   File  
"/usr/local/lib/python2.3/site-packages/scipy/special/orthogonal.py",  
line 457, in c_roots
     [x,w,mu0] = j_roots(n,-0.5,-0.5,mu=1)
   File  
"/usr/local/lib/python2.3/site-packages/scipy/special/orthogonal.py",  
line 155, in j_roots
     val = gen_roots_and_weights(n,an_J,sbn_J,mu0)
   File  
"/usr/local/lib/python2.3/site-packages/scipy/special/orthogonal.py",  
line 121, in gen_roots_and_weights
     eig = get_eig_func()
   File  
"/usr/local/lib/python2.3/site-packages/scipy/special/orthogonal.py",  
line 91, in get_eig_func
     eig = scipy.linalg.eig
AttributeError: 'module' object has no attribute 'eig'

======================================================================
ERROR: check_chebys (scipy.special.basic.test_basic.test_chebys)
----------------------------------------------------------------------
Traceback (most recent call last):
   File  
"/usr/local/lib/python2.3/site-packages/scipy/special/tests/ 
test_basic.py", line 692, in check_chebys
     S0 = chebys(0)
   File  
"/usr/local/lib/python2.3/site-packages/scipy/special/orthogonal.py",  
line 501, in chebys
     x,w,mu0 = s_roots(n1,mu=1)
   File  
"/usr/local/lib/python2.3/site-packages/scipy/special/orthogonal.py",  
line 488, in s_roots
     [x,w,mu0] = j_roots(n,0.5,0.5,mu=1)
   File  
"/usr/local/lib/python2.3/site-packages/scipy/special/orthogonal.py",  
line 155, in j_roots
     val = gen_roots_and_weights(n,an_J,sbn_J,mu0)
   File  
"/usr/local/lib/python2.3/site-packages/scipy/special/orthogonal.py",  
line 121, in gen_roots_and_weights
     eig = get_eig_func()
   File  
"/usr/local/lib/python2.3/site-packages/scipy/special/orthogonal.py",  
line 91, in get_eig_func
     eig = scipy.linalg.eig
AttributeError: 'module' object has no attribute 'eig'

======================================================================
ERROR: check_chebyt (scipy.special.basic.test_basic.test_chebyt)
----------------------------------------------------------------------
Traceback (most recent call last):
   File  
"/usr/local/lib/python2.3/site-packages/scipy/special/tests/ 
test_basic.py", line 709, in check_chebyt
     T1 = chebyt(1)
   File  
"/usr/local/lib/python2.3/site-packages/scipy/special/orthogonal.py",  
line 419, in chebyt
     x,w,mu = t_roots(n1,mu=1)
   File  
"/usr/local/lib/python2.3/site-packages/scipy/special/orthogonal.py",  
line 405, in t_roots
     val = gen_roots_and_weights(n,an_J,sbn_J,mu0)
   File  
"/usr/local/lib/python2.3/site-packages/scipy/special/orthogonal.py",  
line 121, in gen_roots_and_weights
     eig = get_eig_func()
   File  
"/usr/local/lib/python2.3/site-packages/scipy/special/orthogonal.py",  
line 91, in get_eig_func
     eig = scipy.linalg.eig
AttributeError: 'module' object has no attribute 'eig'

======================================================================
ERROR: check_chebyu (scipy.special.basic.test_basic.test_chebyu)
----------------------------------------------------------------------
Traceback (most recent call last):
   File  
"/usr/local/lib/python2.3/site-packages/scipy/special/tests/ 
test_basic.py", line 725, in check_chebyu
     U1 = chebyu(1)
   File  
"/usr/local/lib/python2.3/site-packages/scipy/special/orthogonal.py",  
line 442, in chebyu
     base = jacobi(n,0.5,0.5,monic=monic)
   File  
"/usr/local/lib/python2.3/site-packages/scipy/special/orthogonal.py",  
line 169, in jacobi
     x,w,mu = j_roots(n,alpha,beta,mu=1)
   File  
"/usr/local/lib/python2.3/site-packages/scipy/special/orthogonal.py",  
line 155, in j_roots
     val = gen_roots_and_weights(n,an_J,sbn_J,mu0)
   File  
"/usr/local/lib/python2.3/site-packages/scipy/special/orthogonal.py",  
line 121, in gen_roots_and_weights
     eig = get_eig_func()
   File  
"/usr/local/lib/python2.3/site-packages/scipy/special/orthogonal.py",  
line 91, in get_eig_func
     eig = scipy.linalg.eig
AttributeError: 'module' object has no attribute 'eig'

======================================================================
ERROR: check_gegenbauer (scipy.special.basic.test_basic.test_gegenbauer)
----------------------------------------------------------------------
Traceback (most recent call last):
   File  
"/usr/local/lib/python2.3/site-packages/scipy/special/tests/ 
test_basic.py", line 1089, in check_gegenbauer
     Ca1 = gegenbauer(1,a)
   File  
"/usr/local/lib/python2.3/site-packages/scipy/special/orthogonal.py",  
line 383, in gegenbauer
     base = jacobi(n,alpha-0.5,alpha-0.5,monic=monic)
   File  
"/usr/local/lib/python2.3/site-packages/scipy/special/orthogonal.py",  
line 169, in jacobi
     x,w,mu = j_roots(n,alpha,beta,mu=1)
   File  
"/usr/local/lib/python2.3/site-packages/scipy/special/orthogonal.py",  
line 155, in j_roots
     val = gen_roots_and_weights(n,an_J,sbn_J,mu0)
   File  
"/usr/local/lib/python2.3/site-packages/scipy/special/orthogonal.py",  
line 121, in gen_roots_and_weights
     eig = get_eig_func()
   File  
"/usr/local/lib/python2.3/site-packages/scipy/special/orthogonal.py",  
line 91, in get_eig_func
     eig = scipy.linalg.eig
AttributeError: 'module' object has no attribute 'eig'

======================================================================
ERROR: check_hermite (scipy.special.basic.test_basic.test_hermite)
----------------------------------------------------------------------
Traceback (most recent call last):
   File  
"/usr/local/lib/python2.3/site-packages/scipy/special/tests/ 
test_basic.py", line 1044, in check_hermite
     H0 = hermite(0)
   File  
"/usr/local/lib/python2.3/site-packages/scipy/special/orthogonal.py",  
line 325, in hermite
     x,w,mu0 = h_roots(n1,mu=1)
   File  
"/usr/local/lib/python2.3/site-packages/scipy/special/orthogonal.py",  
line 312, in h_roots
     val = gen_roots_and_weights(n,an_H,sbn_H,mu0)
   File  
"/usr/local/lib/python2.3/site-packages/scipy/special/orthogonal.py",  
line 121, in gen_roots_and_weights
     eig = get_eig_func()
   File  
"/usr/local/lib/python2.3/site-packages/scipy/special/orthogonal.py",  
line 91, in get_eig_func
     eig = scipy.linalg.eig
AttributeError: 'module' object has no attribute 'eig'

======================================================================
ERROR: check_hermitenorm (scipy.special.basic.test_basic.test_hermite)
----------------------------------------------------------------------
Traceback (most recent call last):
   File  
"/usr/local/lib/python2.3/site-packages/scipy/special/tests/ 
test_basic.py", line 1060, in check_hermitenorm
     H0 = hermitenorm(0)
   File  
"/usr/local/lib/python2.3/site-packages/scipy/special/orthogonal.py",  
line 358, in hermitenorm
     x,w,mu0 = he_roots(n1,mu=1)
   File  
"/usr/local/lib/python2.3/site-packages/scipy/special/orthogonal.py",  
line 345, in he_roots
     val = gen_roots_and_weights(n,an_He,sbn_He,mu0)
   File  
"/usr/local/lib/python2.3/site-packages/scipy/special/orthogonal.py",  
line 121, in gen_roots_and_weights
     eig = get_eig_func()
   File  
"/usr/local/lib/python2.3/site-packages/scipy/special/orthogonal.py",  
line 91, in get_eig_func
     eig = scipy.linalg.eig
AttributeError: 'module' object has no attribute 'eig'

======================================================================
ERROR: check_jacobi (scipy.special.basic.test_basic.test_jacobi)
----------------------------------------------------------------------
Traceback (most recent call last):
   File  
"/usr/local/lib/python2.3/site-packages/scipy/special/tests/ 
test_basic.py", line 1263, in check_jacobi
     P1 = jacobi(1,a,b)
   File  
"/usr/local/lib/python2.3/site-packages/scipy/special/orthogonal.py",  
line 169, in jacobi
     x,w,mu = j_roots(n,alpha,beta,mu=1)
   File  
"/usr/local/lib/python2.3/site-packages/scipy/special/orthogonal.py",  
line 155, in j_roots
     val = gen_roots_and_weights(n,an_J,sbn_J,mu0)
   File  
"/usr/local/lib/python2.3/site-packages/scipy/special/orthogonal.py",  
line 121, in gen_roots_and_weights
     eig = get_eig_func()
   File  
"/usr/local/lib/python2.3/site-packages/scipy/special/orthogonal.py",  
line 91, in get_eig_func
     eig = scipy.linalg.eig
AttributeError: 'module' object has no attribute 'eig'

======================================================================
ERROR: check_genlaguerre (scipy.special.basic.test_basic.test_laguerre)
----------------------------------------------------------------------
Traceback (most recent call last):
   File  
"/usr/local/lib/python2.3/site-packages/scipy/special/tests/ 
test_basic.py", line 1567, in check_genlaguerre
     lag0 = genlaguerre(0,k)
   File  
"/usr/local/lib/python2.3/site-packages/scipy/special/orthogonal.py",  
line 267, in genlaguerre
     x,w,mu0 = la_roots(n1,alpha,mu=1)
   File  
"/usr/local/lib/python2.3/site-packages/scipy/special/orthogonal.py",  
line 251, in la_roots
     val = gen_roots_and_weights(n,an_La,sbn_La,mu0)
   File  
"/usr/local/lib/python2.3/site-packages/scipy/special/orthogonal.py",  
line 121, in gen_roots_and_weights
     eig = get_eig_func()
   File  
"/usr/local/lib/python2.3/site-packages/scipy/special/orthogonal.py",  
line 91, in get_eig_func
     eig = scipy.linalg.eig
AttributeError: 'module' object has no attribute 'eig'

======================================================================
ERROR: check_laguerre (scipy.special.basic.test_basic.test_laguerre)
----------------------------------------------------------------------
Traceback (most recent call last):
   File  
"/usr/local/lib/python2.3/site-packages/scipy/special/tests/ 
test_basic.py", line 1552, in check_laguerre
     lag0 = laguerre(0)
   File  
"/usr/local/lib/python2.3/site-packages/scipy/special/orthogonal.py",  
line 292, in laguerre
     x,w,mu0 = l_roots(n1,mu=1)
   File  
"/usr/local/lib/python2.3/site-packages/scipy/special/orthogonal.py",  
line 283, in l_roots
     return la_roots(n,0.0,mu=mu)
   File  
"/usr/local/lib/python2.3/site-packages/scipy/special/orthogonal.py",  
line 251, in la_roots
     val = gen_roots_and_weights(n,an_La,sbn_La,mu0)
   File  
"/usr/local/lib/python2.3/site-packages/scipy/special/orthogonal.py",  
line 121, in gen_roots_and_weights
     eig = get_eig_func()
   File  
"/usr/local/lib/python2.3/site-packages/scipy/special/orthogonal.py",  
line 91, in get_eig_func
     eig = scipy.linalg.eig
AttributeError: 'module' object has no attribute 'eig'

======================================================================
ERROR: check_legendre (scipy.special.basic.test_basic.test_legendre)
----------------------------------------------------------------------
Traceback (most recent call last):
   File  
"/usr/local/lib/python2.3/site-packages/scipy/special/tests/ 
test_basic.py", line 1581, in check_legendre
     leg0 = legendre(0)
   File  
"/usr/local/lib/python2.3/site-packages/scipy/special/orthogonal.py",  
line 569, in legendre
     x,w,mu0 = p_roots(n1,mu=1)
   File  
"/usr/local/lib/python2.3/site-packages/scipy/special/orthogonal.py",  
line 560, in p_roots
     return j_roots(n,0.0,0.0,mu=mu)
   File  
"/usr/local/lib/python2.3/site-packages/scipy/special/orthogonal.py",  
line 155, in j_roots
     val = gen_roots_and_weights(n,an_J,sbn_J,mu0)
   File  
"/usr/local/lib/python2.3/site-packages/scipy/special/orthogonal.py",  
line 121, in gen_roots_and_weights
     eig = get_eig_func()
   File  
"/usr/local/lib/python2.3/site-packages/scipy/special/orthogonal.py",  
line 91, in get_eig_func
     eig = scipy.linalg.eig
AttributeError: 'module' object has no attribute 'eig'

======================================================================
ERROR: check_sh_chebyu (scipy.special.basic.test_basic.test_sh_chebyu)
----------------------------------------------------------------------
Traceback (most recent call last):
   File  
"/usr/local/lib/python2.3/site-packages/scipy/special/tests/ 
test_basic.py", line 1855, in check_sh_chebyu
     Us1 = sh_chebyu(1)
   File  
"/usr/local/lib/python2.3/site-packages/scipy/special/orthogonal.py",  
line 547, in sh_chebyu
     base = sh_jacobi(n,2.0,1.5,monic=monic)
   File  
"/usr/local/lib/python2.3/site-packages/scipy/special/orthogonal.py",  
line 228, in sh_jacobi
     x,w,mu0 = js_roots(n1,p,q,mu=1)
   File  
"/usr/local/lib/python2.3/site-packages/scipy/special/orthogonal.py",  
line 205, in js_roots
     val = gen_roots_and_weights(n,an_Js,sbn_Js,mu0)
   File  
"/usr/local/lib/python2.3/site-packages/scipy/special/orthogonal.py",  
line 121, in gen_roots_and_weights
     eig = get_eig_func()
   File  
"/usr/local/lib/python2.3/site-packages/scipy/special/orthogonal.py",  
line 91, in get_eig_func
     eig = scipy.linalg.eig
AttributeError: 'module' object has no attribute 'eig'

======================================================================
ERROR: check_sh_jacobi (scipy.special.basic.test_basic.test_sh_jacobi)
----------------------------------------------------------------------
Traceback (most recent call last):
   File  
"/usr/local/lib/python2.3/site-packages/scipy/special/tests/ 
test_basic.py", line 1883, in check_sh_jacobi
     G1 = sh_jacobi(1,p,q)
   File  
"/usr/local/lib/python2.3/site-packages/scipy/special/orthogonal.py",  
line 228, in sh_jacobi
     x,w,mu0 = js_roots(n1,p,q,mu=1)
   File  
"/usr/local/lib/python2.3/site-packages/scipy/special/orthogonal.py",  
line 205, in js_roots
     val = gen_roots_and_weights(n,an_Js,sbn_Js,mu0)
   File  
"/usr/local/lib/python2.3/site-packages/scipy/special/orthogonal.py",  
line 121, in gen_roots_and_weights
     eig = get_eig_func()
   File  
"/usr/local/lib/python2.3/site-packages/scipy/special/orthogonal.py",  
line 91, in get_eig_func
     eig = scipy.linalg.eig
AttributeError: 'module' object has no attribute 'eig'

======================================================================
ERROR: check_sh_legendre  
(scipy.special.basic.test_basic.test_sh_legendre)
----------------------------------------------------------------------
Traceback (most recent call last):
   File  
"/usr/local/lib/python2.3/site-packages/scipy/special/tests/ 
test_basic.py", line 1806, in check_sh_legendre
     Ps1 = sh_legendre(1)
   File  
"/usr/local/lib/python2.3/site-packages/scipy/special/orthogonal.py",  
line 593, in sh_legendre
     x,w,mu0 = ps_roots(n,mu=1)
   File  
"/usr/local/lib/python2.3/site-packages/scipy/special/orthogonal.py",  
line 584, in ps_roots
     return js_roots(n,1.0,1.0,mu=mu)
   File  
"/usr/local/lib/python2.3/site-packages/scipy/special/orthogonal.py",  
line 205, in js_roots
     val = gen_roots_and_weights(n,an_Js,sbn_Js,mu0)
   File  
"/usr/local/lib/python2.3/site-packages/scipy/special/orthogonal.py",  
line 121, in gen_roots_and_weights
     eig = get_eig_func()
   File  
"/usr/local/lib/python2.3/site-packages/scipy/special/orthogonal.py",  
line 91, in get_eig_func
     eig = scipy.linalg.eig
AttributeError: 'module' object has no attribute 'eig'

----------------------------------------------------------------------
Ran 703 tests in 6.979s

FAILED (errors=15)



More information about the SciPy-user mailing list