[SciPy-user] FAIL: check_basic (scipy.signal.signaltools.test_signaltools.test_wiener

Nils Wagner nwagner at mecha.uni-stuttgart.de
Tue Jun 1 03:03:21 CDT 2004


 From latest cvs

======================================================================
FAIL: check_basic (scipy.signal.signaltools.test_signaltools.test_wiener)
----------------------------------------------------------------------
Traceback (most recent call last):
   File 
"/usr/lib/python2.3/site-packages/scipy/signal/tests/test_signaltools.py", 
line 33, in check_basic
     assert_array_almost_equal(h,correct,decimal=6)
   File "/usr/lib/python2.3/site-packages/scipy_test/testing.py", line 
681, in assert_array_almost_equal
     assert cond,\
AssertionError:
Arrays are not almost equal (mismatch 100.0%):
         Array 1: [[ 2.1111111  6.         4.         3.       ]
  [ 3.         5.         6.         2.       ]
  [ 2.         3.         5...
         Array 2: [[ 2.1637427  3.2222222  2.8888889  1.6666667]
  [ 2.6666667  4.3333333  4.4444444  2.8888889]
  [ 2.2222222  4.4444444  5...


----------------------------------------------------------------------
Ran 935 tests in 2.952s

FAILED (failures=1)
<unittest.TextTestRunner object at 0x46c304ec>



More information about the SciPy-user mailing list