[SciPy-user] SciPy on IA-64

Nicolas Pernetty nicopernetty at yahoo.fr
Tue Jul 12 13:54:10 CDT 2005


On Mon, 11 Jul 2005 22:43:48 +0200, Nicolas Pernetty
<nicopernetty at yahoo.fr> wrote :

> Hello,
> 
> While trying to compile SciPy on a Linux box on top of an Itanium
> processor I ran into an error in fpuset.c.
> It seems that IA-64 isn't referenced in either fpuset.c and
> README.fpu.
> 
> Has someone managed to compile SciPy on IA-64 ?
> What shoud I do to compile fpuset.c or skip it ?
> 

Ok I've skipped the 'xplt' package by modifying ignore_packages
in setup.py. SciPy then compiled without other problems but when trying
the tests I got a bunch of errors.

Is there someone else out there using SciPy on IA-64 or am I the only
one ? I'll try to debug the 7 errors which actually give back random
results instead of throwing an exception...

Regards,

======================================================================
ERROR: check_pBIGBIG (scipy.stats.stats.test_stats.test_corr)
----------------------------------------------------------------------
Traceback (most recent call last):
  File
"/home/nico/local/lib/python2.4/site-packages/scipy/stats/tests/test_st
ats.py", line 211, in check_pBIGBIG    y = scipy.stats.pearsonr(BIG,BIG)
  File
"/home/nico/local/lib/python2.4/site-packages/scipy/stats/stats.py",
line 1244, in pearsonr    prob = betai(0.5*df,0.5,df/(df+t*t))  File
"/home/nico/local/lib/python2.4/site-packages/scipy/stats/stats.py",
line 1751, in betai    return special.betainc(a,b,x) TypeError: function
not supported for these types, and can't coerce to supported types

======================================================================
ERROR: check_pBIGHUGE (scipy.stats.stats.test_stats.test_corr)
----------------------------------------------------------------------
Traceback (most recent call last):
  File
"/home/nico/local/lib/python2.4/site-packages/scipy/stats/tests/test_st
ats.py", line 219, in check_pBIGHUGE    y =
scipy.stats.pearsonr(BIG,HUGE)  File
"/home/nico/local/lib/python2.4/site-packages/scipy/stats/stats.py",
line 1244, in pearsonr    prob = betai(0.5*df,0.5,df/(df+t*t))  File
"/home/nico/local/lib/python2.4/site-packages/scipy/stats/stats.py",
line 1751, in betai    return special.betainc(a,b,x) TypeError: function
not supported for these types, and can't coerce to supported types

======================================================================
ERROR: check_pBIGLITTLE (scipy.stats.stats.test_stats.test_corr)
----------------------------------------------------------------------
Traceback (most recent call last):
  File
"/home/nico/local/lib/python2.4/site-packages/scipy/stats/tests/test_st
ats.py", line 215, in check_pBIGLITTLE    y =
scipy.stats.pearsonr(BIG,LITTLE)  File
"/home/nico/local/lib/python2.4/site-packages/scipy/stats/stats.py",
line 1244, in pearsonr    prob = betai(0.5*df,0.5,df/(df+t*t))  File
"/home/nico/local/lib/python2.4/site-packages/scipy/stats/stats.py",
line 1751, in betai    return special.betainc(a,b,x) TypeError: function
not supported for these types, and can't coerce to supported types

======================================================================
ERROR: check_pBIGROUND (scipy.stats.stats.test_stats.test_corr)
----------------------------------------------------------------------
Traceback (most recent call last):
  File
"/home/nico/local/lib/python2.4/site-packages/scipy/stats/tests/test_st
ats.py", line 227, in check_pBIGROUND    y =
scipy.stats.pearsonr(BIG,ROUND)  File
"/home/nico/local/lib/python2.4/site-packages/scipy/stats/stats.py",
line 1244, in pearsonr    prob = betai(0.5*df,0.5,df/(df+t*t))  File
"/home/nico/local/lib/python2.4/site-packages/scipy/stats/stats.py",
line 1751, in betai    return special.betainc(a,b,x) TypeError: function
not supported for these types, and can't coerce to supported types

======================================================================
ERROR: check_pBIGTINY (scipy.stats.stats.test_stats.test_corr)
----------------------------------------------------------------------
Traceback (most recent call last):
  File
"/home/nico/local/lib/python2.4/site-packages/scipy/stats/tests/test_st
ats.py", line 223, in check_pBIGTINY    y =
scipy.stats.pearsonr(BIG,TINY)  File
"/home/nico/local/lib/python2.4/site-packages/scipy/stats/stats.py",
line 1244, in pearsonr    prob = betai(0.5*df,0.5,df/(df+t*t))  File
"/home/nico/local/lib/python2.4/site-packages/scipy/stats/stats.py",
line 1751, in betai    return special.betainc(a,b,x) TypeError: function
not supported for these types, and can't coerce to supported types

======================================================================
ERROR: check_pHUGEHUGE (scipy.stats.stats.test_stats.test_corr)
----------------------------------------------------------------------
Traceback (most recent call last):
  File
"/home/nico/local/lib/python2.4/site-packages/scipy/stats/tests/test_st
ats.py", line 247, in check_pHUGEHUGE    y =
scipy.stats.pearsonr(HUGE,HUGE)  File
"/home/nico/local/lib/python2.4/site-packages/scipy/stats/stats.py",
line 1244, in pearsonr    prob = betai(0.5*df,0.5,df/(df+t*t))  File
"/home/nico/local/lib/python2.4/site-packages/scipy/stats/stats.py",
line 1751, in betai    return special.betainc(a,b,x) TypeError: function
not supported for these types, and can't coerce to supported types

======================================================================
ERROR: check_pHUGEROUND (scipy.stats.stats.test_stats.test_corr)
----------------------------------------------------------------------
Traceback (most recent call last):
  File
"/home/nico/local/lib/python2.4/site-packages/scipy/stats/tests/test_st
ats.py", line 255, in check_pHUGEROUND    y =
scipy.stats.pearsonr(HUGE,ROUND)  File
"/home/nico/local/lib/python2.4/site-packages/scipy/stats/stats.py",
line 1244, in pearsonr    prob = betai(0.5*df,0.5,df/(df+t*t))  File
"/home/nico/local/lib/python2.4/site-packages/scipy/stats/stats.py",
line 1751, in betai    return special.betainc(a,b,x) TypeError: function
not supported for these types, and can't coerce to supported types

======================================================================
ERROR: check_pHUGETINY (scipy.stats.stats.test_stats.test_corr)
----------------------------------------------------------------------
Traceback (most recent call last):
  File
"/home/nico/local/lib/python2.4/site-packages/scipy/stats/tests/test_st
ats.py", line 251, in check_pHUGETINY    y =
scipy.stats.pearsonr(HUGE,TINY)  File
"/home/nico/local/lib/python2.4/site-packages/scipy/stats/stats.py",
line 1244, in pearsonr    prob = betai(0.5*df,0.5,df/(df+t*t))  File
"/home/nico/local/lib/python2.4/site-packages/scipy/stats/stats.py",
line 1751, in betai    return special.betainc(a,b,x) TypeError: function
not supported for these types, and can't coerce to supported types

======================================================================
ERROR: check_pLITTLEHUGE (scipy.stats.stats.test_stats.test_corr)
----------------------------------------------------------------------
Traceback (most recent call last):
  File
"/home/nico/local/lib/python2.4/site-packages/scipy/stats/tests/test_st
ats.py", line 235, in check_pLITTLEHUGE    y =
scipy.stats.pearsonr(LITTLE,HUGE)  File
"/home/nico/local/lib/python2.4/site-packages/scipy/stats/stats.py",
line 1244, in pearsonr    prob = betai(0.5*df,0.5,df/(df+t*t))  File
"/home/nico/local/lib/python2.4/site-packages/scipy/stats/stats.py",
line 1751, in betai    return special.betainc(a,b,x) TypeError: function
not supported for these types, and can't coerce to supported types

======================================================================
ERROR: check_pLITTLELITTLE (scipy.stats.stats.test_stats.test_corr)
----------------------------------------------------------------------
Traceback (most recent call last):
  File
"/home/nico/local/lib/python2.4/site-packages/scipy/stats/tests/test_st
ats.py", line 231, in check_pLITTLELITTLE    y =
scipy.stats.pearsonr(LITTLE,LITTLE)  File
"/home/nico/local/lib/python2.4/site-packages/scipy/stats/stats.py",
line 1244, in pearsonr    prob = betai(0.5*df,0.5,df/(df+t*t))  File
"/home/nico/local/lib/python2.4/site-packages/scipy/stats/stats.py",
line 1751, in betai    return special.betainc(a,b,x) TypeError: function
not supported for these types, and can't coerce to supported types

======================================================================
ERROR: check_pLITTLEROUND (scipy.stats.stats.test_stats.test_corr)
----------------------------------------------------------------------
Traceback (most recent call last):
  File
"/home/nico/local/lib/python2.4/site-packages/scipy/stats/tests/test_st
ats.py", line 243, in check_pLITTLEROUND    y =
scipy.stats.pearsonr(LITTLE,ROUND)  File
"/home/nico/local/lib/python2.4/site-packages/scipy/stats/stats.py",
line 1244, in pearsonr    prob = betai(0.5*df,0.5,df/(df+t*t))  File
"/home/nico/local/lib/python2.4/site-packages/scipy/stats/stats.py",
line 1751, in betai    return special.betainc(a,b,x) TypeError: function
not supported for these types, and can't coerce to supported types

======================================================================
ERROR: check_pLITTLETINY (scipy.stats.stats.test_stats.test_corr)
----------------------------------------------------------------------
Traceback (most recent call last):
  File
"/home/nico/local/lib/python2.4/site-packages/scipy/stats/tests/test_st
ats.py", line 239, in check_pLITTLETINY    y =
scipy.stats.pearsonr(LITTLE,TINY)  File
"/home/nico/local/lib/python2.4/site-packages/scipy/stats/stats.py",
line 1244, in pearsonr    prob = betai(0.5*df,0.5,df/(df+t*t))  File
"/home/nico/local/lib/python2.4/site-packages/scipy/stats/stats.py",
line 1751, in betai    return special.betainc(a,b,x) TypeError: function
not supported for these types, and can't coerce to supported types

======================================================================
ERROR: check_pROUNDROUND (scipy.stats.stats.test_stats.test_corr)
----------------------------------------------------------------------
Traceback (most recent call last):
  File
"/home/nico/local/lib/python2.4/site-packages/scipy/stats/tests/test_st
ats.py", line 267, in check_pROUNDROUND    y =
scipy.stats.pearsonr(ROUND,ROUND)  File
"/home/nico/local/lib/python2.4/site-packages/scipy/stats/stats.py",
line 1244, in pearsonr    prob = betai(0.5*df,0.5,df/(df+t*t))  File
"/home/nico/local/lib/python2.4/site-packages/scipy/stats/stats.py",
line 1751, in betai    return special.betainc(a,b,x) TypeError: function
not supported for these types, and can't coerce to supported types

======================================================================
ERROR: check_pTINYROUND (scipy.stats.stats.test_stats.test_corr)
----------------------------------------------------------------------
Traceback (most recent call last):
  File
"/home/nico/local/lib/python2.4/site-packages/scipy/stats/tests/test_st
ats.py", line 263, in check_pTINYROUND    y =
scipy.stats.pearsonr(TINY,ROUND)  File
"/home/nico/local/lib/python2.4/site-packages/scipy/stats/stats.py",
line 1244, in pearsonr    prob = betai(0.5*df,0.5,df/(df+t*t))  File
"/home/nico/local/lib/python2.4/site-packages/scipy/stats/stats.py",
line 1751, in betai    return special.betainc(a,b,x) TypeError: function
not supported for these types, and can't coerce to supported types

======================================================================
ERROR: check_pTINYTINY (scipy.stats.stats.test_stats.test_corr)
----------------------------------------------------------------------
Traceback (most recent call last):
  File
"/home/nico/local/lib/python2.4/site-packages/scipy/stats/tests/test_st
ats.py", line 259, in check_pTINYTINY    y =
scipy.stats.pearsonr(TINY,TINY)  File
"/home/nico/local/lib/python2.4/site-packages/scipy/stats/stats.py",
line 1244, in pearsonr    prob = betai(0.5*df,0.5,df/(df+t*t))  File
"/home/nico/local/lib/python2.4/site-packages/scipy/stats/stats.py",
line 1751, in betai    return special.betainc(a,b,x) TypeError: function
not supported for these types, and can't coerce to supported types

======================================================================
ERROR: check_pXBIG (scipy.stats.stats.test_stats.test_corr)
----------------------------------------------------------------------
Traceback (most recent call last):
  File
"/home/nico/local/lib/python2.4/site-packages/scipy/stats/tests/test_st
ats.py", line 191, in check_pXBIG    y = scipy.stats.pearsonr(X,BIG)
  File
"/home/nico/local/lib/python2.4/site-packages/scipy/stats/stats.py",
line 1244, in pearsonr    prob = betai(0.5*df,0.5,df/(df+t*t))  File
"/home/nico/local/lib/python2.4/site-packages/scipy/stats/stats.py",
line 1751, in betai    return special.betainc(a,b,x) TypeError: function
not supported for these types, and can't coerce to supported types

======================================================================
ERROR: check_pXHUGE (scipy.stats.stats.test_stats.test_corr)
----------------------------------------------------------------------
Traceback (most recent call last):
  File
"/home/nico/local/lib/python2.4/site-packages/scipy/stats/tests/test_st
ats.py", line 199, in check_pXHUGE    y = scipy.stats.pearsonr(X,HUGE)
  File
"/home/nico/local/lib/python2.4/site-packages/scipy/stats/stats.py",
line 1244, in pearsonr    prob = betai(0.5*df,0.5,df/(df+t*t))  File
"/home/nico/local/lib/python2.4/site-packages/scipy/stats/stats.py",
line 1751, in betai    return special.betainc(a,b,x) TypeError: function
not supported for these types, and can't coerce to supported types

======================================================================
ERROR: check_pXLITTLE (scipy.stats.stats.test_stats.test_corr)
----------------------------------------------------------------------
Traceback (most recent call last):
  File
"/home/nico/local/lib/python2.4/site-packages/scipy/stats/tests/test_st
ats.py", line 195, in check_pXLITTLE    y =
scipy.stats.pearsonr(X,LITTLE)  File
"/home/nico/local/lib/python2.4/site-packages/scipy/stats/stats.py",
line 1244, in pearsonr    prob = betai(0.5*df,0.5,df/(df+t*t))  File
"/home/nico/local/lib/python2.4/site-packages/scipy/stats/stats.py",
line 1751, in betai    return special.betainc(a,b,x) TypeError: function
not supported for these types, and can't coerce to supported types

======================================================================
ERROR: check_pXROUND (scipy.stats.stats.test_stats.test_corr)
----------------------------------------------------------------------
Traceback (most recent call last):
  File
"/home/nico/local/lib/python2.4/site-packages/scipy/stats/tests/test_st
ats.py", line 207, in check_pXROUND    y = scipy.stats.pearsonr(X,ROUND)
  File
"/home/nico/local/lib/python2.4/site-packages/scipy/stats/stats.py",
line 1244, in pearsonr    prob = betai(0.5*df,0.5,df/(df+t*t))  File
"/home/nico/local/lib/python2.4/site-packages/scipy/stats/stats.py",
line 1751, in betai    return special.betainc(a,b,x) TypeError: function
not supported for these types, and can't coerce to supported types

======================================================================
ERROR: check_pXTINY (scipy.stats.stats.test_stats.test_corr)
----------------------------------------------------------------------
Traceback (most recent call last):
  File
"/home/nico/local/lib/python2.4/site-packages/scipy/stats/tests/test_st
ats.py", line 203, in check_pXTINY    y = scipy.stats.pearsonr(X,TINY)
  File
"/home/nico/local/lib/python2.4/site-packages/scipy/stats/stats.py",
line 1244, in pearsonr    prob = betai(0.5*df,0.5,df/(df+t*t))  File
"/home/nico/local/lib/python2.4/site-packages/scipy/stats/stats.py",
line 1751, in betai    return special.betainc(a,b,x) TypeError: function
not supported for these types, and can't coerce to supported types

======================================================================
ERROR: check_pXX (scipy.stats.stats.test_stats.test_corr)
----------------------------------------------------------------------
Traceback (most recent call last):
  File
"/home/nico/local/lib/python2.4/site-packages/scipy/stats/tests/test_st
ats.py", line 187, in check_pXX    y = scipy.stats.pearsonr(X,X)
  File
"/home/nico/local/lib/python2.4/site-packages/scipy/stats/stats.py",
line 1244, in pearsonr    prob = betai(0.5*df,0.5,df/(df+t*t))  File
"/home/nico/local/lib/python2.4/site-packages/scipy/stats/stats.py",
line 1751, in betai    return special.betainc(a,b,x) TypeError: function
not supported for these types, and can't coerce to supported types

======================================================================
ERROR: W.II.F.  Regress BIG on X.
----------------------------------------------------------------------
Traceback (most recent call last):
  File
"/home/nico/local/lib/python2.4/site-packages/scipy/stats/tests/test_st
ats.py", line 371, in check_linregressBIGX    y =
scipy.stats.linregress(X,BIG)  File
"/home/nico/local/lib/python2.4/site-packages/scipy/stats/stats.py",
line 1371, in linregress    prob = betai(0.5*df,0.5,df/(df+t*t))  File
"/home/nico/local/lib/python2.4/site-packages/scipy/stats/stats.py",
line 1751, in betai    return special.betainc(a,b,x) TypeError: function
not supported for these types, and can't coerce to supported types

======================================================================
ERROR: W.IV.B.  Regress X on X.
----------------------------------------------------------------------
Traceback (most recent call last):
  File
"/home/nico/local/lib/python2.4/site-packages/scipy/stats/tests/test_st
ats.py", line 395, in check_regressXX    y = scipy.stats.linregress(X,X)
  File
"/home/nico/local/lib/python2.4/site-packages/scipy/stats/stats.py",
line 1371, in linregress    prob = betai(0.5*df,0.5,df/(df+t*t))  File
"/home/nico/local/lib/python2.4/site-packages/scipy/stats/stats.py",
line 1751, in betai    return special.betainc(a,b,x) TypeError: function
not supported for these types, and can't coerce to supported types

======================================================================
ERROR: W.IV.D. Regress ZERO on X.
----------------------------------------------------------------------
Traceback (most recent call last):
  File
"/home/nico/local/lib/python2.4/site-packages/scipy/stats/tests/test_st
ats.py", line 414, in check_regressZEROX    y =
scipy.stats.linregress(X,ZERO)  File
"/home/nico/local/lib/python2.4/site-packages/scipy/stats/stats.py",
line 1371, in linregress    prob = betai(0.5*df,0.5,df/(df+t*t))  File
"/home/nico/local/lib/python2.4/site-packages/scipy/stats/stats.py",
line 1751, in betai    return special.betainc(a,b,x) TypeError: function
not supported for these types, and can't coerce to supported types

======================================================================
ERROR: check_simple_overdet (scipy.linalg.basic.test_basic.test_lstsq)
----------------------------------------------------------------------
Traceback (most recent call last):
  File
"/home/nico/local/lib/python2.4/site-packages/scipy/linalg/tests/test_b
asic.py", line 361, in check_simple_overdet    x,res,r,s = lstsq(a,b)
  File
"/home/nico/local/lib/python2.4/site-packages/scipy/linalg/basic.py",
line 353, in lstsq    if rank==n: resids = sum(x[n:]**2)
ArithmeticError: Integer overflow in power.

======================================================================
ERROR: check_betainc (scipy.special.basic.test_basic.test_betainc)
----------------------------------------------------------------------
Traceback (most recent call last):
  File
"/home/nico/local/lib/python2.4/site-packages/scipy/special/tests/test_
basic.py", line 652, in check_betainc    btinc = betainc(1,1,.2)
TypeError: function not supported for these types, and can't coerce to
supported types

======================================================================
ERROR: check_betaincinv (scipy.special.basic.test_basic.test_betaincinv)
----------------------------------------------------------------------
Traceback (most recent call last):
  File
"/home/nico/local/lib/python2.4/site-packages/scipy/special/tests/test_
basic.py", line 658, in check_betaincinv    y = betaincinv(2,4,.5)
TypeError: function not supported for these types, and can't coerce to
supported types

======================================================================
ERROR: check_bdtr (scipy.special.basic.test_basic.test_cephes)
----------------------------------------------------------------------
Traceback (most recent call last):
  File
"/home/nico/local/lib/python2.4/site-packages/scipy/special/tests/test_
basic.py", line 50, in check_bdtr   
assert_equal(cephes.bdtr(1,1,0.5),1.0) TypeError: function not supported
for these types, and can't coerce to supported types

======================================================================
ERROR: check_bdtrc (scipy.special.basic.test_basic.test_cephes)
----------------------------------------------------------------------
Traceback (most recent call last):
  File
"/home/nico/local/lib/python2.4/site-packages/scipy/special/tests/test_
basic.py", line 54, in check_bdtrc   
assert_equal(cephes.bdtrc(1,3,0.5),0.5) TypeError: function not
supported for these types, and can't coerce to supported types

======================================================================
ERROR: check_bdtri (scipy.special.basic.test_basic.test_cephes)
----------------------------------------------------------------------
Traceback (most recent call last):
  File
"/home/nico/local/lib/python2.4/site-packages/scipy/special/tests/test_
basic.py", line 52, in check_bdtri   
assert_equal(cephes.bdtri(1,3,0.5),0.5) TypeError: function not
supported for these types, and can't coerce to supported types

======================================================================
ERROR: check_bdtrik (scipy.special.basic.test_basic.test_cephes)
----------------------------------------------------------------------
Traceback (most recent call last):
  File
"/home/nico/local/lib/python2.4/site-packages/scipy/special/tests/test_
basic.py", line 58, in check_bdtrik    cephes.bdtrik(1,3,0.5)
TypeError: function not supported for these types, and can't coerce to
supported types

======================================================================
ERROR: check_bdtrin (scipy.special.basic.test_basic.test_cephes)
----------------------------------------------------------------------
Traceback (most recent call last):
  File
"/home/nico/local/lib/python2.4/site-packages/scipy/special/tests/test_
basic.py", line 56, in check_bdtrin   
assert_equal(cephes.bdtrin(1,0,1),5.0) TypeError: function not supported
for these types, and can't coerce to supported types

======================================================================
ERROR: check_besselpoly (scipy.special.basic.test_basic.test_cephes)
----------------------------------------------------------------------
Traceback (most recent call last):
  File
"/home/nico/local/lib/python2.4/site-packages/scipy/special/tests/test_
basic.py", line 70, in check_besselpoly   
assert_equal(cephes.besselpoly(0,0,0),1.0) TypeError: function not
supported for these types, and can't coerce to supported types

======================================================================
ERROR: check_betainc (scipy.special.basic.test_basic.test_cephes)
----------------------------------------------------------------------
Traceback (most recent call last):
  File
"/home/nico/local/lib/python2.4/site-packages/scipy/special/tests/test_
basic.py", line 75, in check_betainc   
assert_equal(cephes.betainc(1,1,1),1.0) TypeError: function not
supported for these types, and can't coerce to supported types

======================================================================
ERROR: check_betaincinv (scipy.special.basic.test_basic.test_cephes)
----------------------------------------------------------------------
Traceback (most recent call last):
  File
"/home/nico/local/lib/python2.4/site-packages/scipy/special/tests/test_
basic.py", line 79, in check_betaincinv   
assert_equal(cephes.betaincinv(1,1,1),1.0) TypeError: function not
supported for these types, and can't coerce to supported types

======================================================================
ERROR: check_btdtr (scipy.special.basic.test_basic.test_cephes)
----------------------------------------------------------------------
Traceback (most recent call last):
  File
"/home/nico/local/lib/python2.4/site-packages/scipy/special/tests/test_
basic.py", line 82, in check_btdtr   
assert_equal(cephes.btdtr(1,1,1),1.0) TypeError: function not supported
for these types, and can't coerce to supported types

======================================================================
ERROR: check_btdtri (scipy.special.basic.test_basic.test_cephes)
----------------------------------------------------------------------
Traceback (most recent call last):
  File
"/home/nico/local/lib/python2.4/site-packages/scipy/special/tests/test_
basic.py", line 84, in check_btdtri   
assert_equal(cephes.btdtri(1,1,1),1.0) TypeError: function not supported
for these types, and can't coerce to supported types

======================================================================
ERROR: check_btdtria (scipy.special.basic.test_basic.test_cephes)
----------------------------------------------------------------------
Traceback (most recent call last):
  File
"/home/nico/local/lib/python2.4/site-packages/scipy/special/tests/test_
basic.py", line 86, in check_btdtria   
assert_equal(cephes.btdtria(1,1,1),5.0) TypeError: function not
supported for these types, and can't coerce to supported types

======================================================================
ERROR: check_btdtrib (scipy.special.basic.test_basic.test_cephes)
----------------------------------------------------------------------
Traceback (most recent call last):
  File
"/home/nico/local/lib/python2.4/site-packages/scipy/special/tests/test_
basic.py", line 88, in check_btdtrib   
assert_equal(cephes.btdtrib(1,1,1),5.0) TypeError: function not
supported for these types, and can't coerce to supported types

======================================================================
ERROR: check_chndtr (scipy.special.basic.test_basic.test_cephes)
----------------------------------------------------------------------
Traceback (most recent call last):
  File
"/home/nico/local/lib/python2.4/site-packages/scipy/special/tests/test_
basic.py", line 103, in check_chndtr   
assert_equal(cephes.chndtr(0,1,0),0.0) TypeError: function not supported
for these types, and can't coerce to supported types

======================================================================
ERROR: check_chndtridf (scipy.special.basic.test_basic.test_cephes)
----------------------------------------------------------------------
Traceback (most recent call last):
  File
"/home/nico/local/lib/python2.4/site-packages/scipy/special/tests/test_
basic.py", line 105, in check_chndtridf   
assert_equal(cephes.chndtridf(0,0,1),5.0) TypeError: function not
supported for these types, and can't coerce to supported types

======================================================================
ERROR: check_chndtrinc (scipy.special.basic.test_basic.test_cephes)
----------------------------------------------------------------------
Traceback (most recent call last):
  File
"/home/nico/local/lib/python2.4/site-packages/scipy/special/tests/test_
basic.py", line 107, in check_chndtrinc   
assert_equal(cephes.chndtrinc(0,1,0),5.0) TypeError: function not
supported for these types, and can't coerce to supported types

======================================================================
ERROR: check_chndtrix (scipy.special.basic.test_basic.test_cephes)
----------------------------------------------------------------------
Traceback (most recent call last):
  File
"/home/nico/local/lib/python2.4/site-packages/scipy/special/tests/test_
basic.py", line 109, in check_chndtrix   
assert_equal(cephes.chndtrix(0,1,0),0.0) TypeError: function not
supported for these types, and can't coerce to supported types

======================================================================
ERROR: check_fdtr (scipy.special.basic.test_basic.test_cephes)
----------------------------------------------------------------------
Traceback (most recent call last):
  File
"/home/nico/local/lib/python2.4/site-packages/scipy/special/tests/test_
basic.py", line 152, in check_fdtr   
assert_equal(cephes.fdtr(1,1,0),0.0) TypeError: function not supported
for these types, and can't coerce to supported types

======================================================================
ERROR: check_fdtrc (scipy.special.basic.test_basic.test_cephes)
----------------------------------------------------------------------
Traceback (most recent call last):
  File
"/home/nico/local/lib/python2.4/site-packages/scipy/special/tests/test_
basic.py", line 154, in check_fdtrc   
assert_equal(cephes.fdtrc(1,1,0),1.0) TypeError: function not supported
for these types, and can't coerce to supported types

======================================================================
ERROR: check_fdtri (scipy.special.basic.test_basic.test_cephes)
----------------------------------------------------------------------
Traceback (most recent call last):
  File
"/home/nico/local/lib/python2.4/site-packages/scipy/special/tests/test_
basic.py", line 156, in check_fdtri    cephes.fdtri(1,1,0.5)
TypeError: function not supported for these types, and can't coerce to
supported types

======================================================================
ERROR: check_fdtridfd (scipy.special.basic.test_basic.test_cephes)
----------------------------------------------------------------------
Traceback (most recent call last):
  File
"/home/nico/local/lib/python2.4/site-packages/scipy/special/tests/test_
basic.py", line 158, in check_fdtridfd   
assert_equal(cephes.fdtridfd(1,0,0),5.0) TypeError: function not
supported for these types, and can't coerce to supported types

======================================================================
ERROR: check_gdtr (scipy.special.basic.test_basic.test_cephes)
----------------------------------------------------------------------
Traceback (most recent call last):
  File
"/home/nico/local/lib/python2.4/site-packages/scipy/special/tests/test_
basic.py", line 175, in check_gdtr   
assert_equal(cephes.gdtr(1,1,0),0.0) TypeError: function not supported
for these types, and can't coerce to supported types

======================================================================
ERROR: check_gdtrc (scipy.special.basic.test_basic.test_cephes)
----------------------------------------------------------------------
Traceback (most recent call last):
  File
"/home/nico/local/lib/python2.4/site-packages/scipy/special/tests/test_
basic.py", line 177, in check_gdtrc   
assert_equal(cephes.gdtrc(1,1,0),1.0) TypeError: function not supported
for these types, and can't coerce to supported types

======================================================================
ERROR: check_gdtria (scipy.special.basic.test_basic.test_cephes)
----------------------------------------------------------------------
Traceback (most recent call last):
  File
"/home/nico/local/lib/python2.4/site-packages/scipy/special/tests/test_
basic.py", line 179, in check_gdtria   
assert_equal(cephes.gdtria(0,1,1),0.0) TypeError: function not supported
for these types, and can't coerce to supported types

======================================================================
ERROR: check_gdtrib (scipy.special.basic.test_basic.test_cephes)
----------------------------------------------------------------------
Traceback (most recent call last):
  File
"/home/nico/local/lib/python2.4/site-packages/scipy/special/tests/test_
basic.py", line 181, in check_gdtrib    cephes.gdtrib(1,0,1)
TypeError: function not supported for these types, and can't coerce to
supported types

======================================================================
ERROR: check_gdtrix (scipy.special.basic.test_basic.test_cephes)
----------------------------------------------------------------------
Traceback (most recent call last):
  File
"/home/nico/local/lib/python2.4/site-packages/scipy/special/tests/test_
basic.py", line 184, in check_gdtrix    cephes.gdtrix(1,1,.1)
TypeError: function not supported for these types, and can't coerce to
supported types

======================================================================
ERROR: check_hyperu (scipy.special.basic.test_basic.test_cephes)
----------------------------------------------------------------------
Traceback (most recent call last):
  File
"/home/nico/local/lib/python2.4/site-packages/scipy/special/tests/test_
basic.py", line 206, in check_hyperu   
assert_equal(cephes.hyperu(0,1,1),1.0) TypeError: function not supported
for these types, and can't coerce to supported types

======================================================================
ERROR: check_lpmv (scipy.special.basic.test_basic.test_cephes)
----------------------------------------------------------------------
Traceback (most recent call last):
  File
"/home/nico/local/lib/python2.4/site-packages/scipy/special/tests/test_
basic.py", line 282, in check_lpmv   
assert_equal(cephes.lpmv(0,0,1),1.0) TypeError: function not supported
for these types, and can't coerce to supported types

======================================================================
ERROR: check_nbdtr (scipy.special.basic.test_basic.test_cephes)
----------------------------------------------------------------------
Traceback (most recent call last):
  File
"/home/nico/local/lib/python2.4/site-packages/scipy/special/tests/test_
basic.py", line 309, in check_nbdtr   
assert_equal(cephes.nbdtr(1,1,1),1.0) TypeError: function not supported
for these types, and can't coerce to supported types

======================================================================
ERROR: check_nbdtrc (scipy.special.basic.test_basic.test_cephes)
----------------------------------------------------------------------
Traceback (most recent call last):
  File
"/home/nico/local/lib/python2.4/site-packages/scipy/special/tests/test_
basic.py", line 311, in check_nbdtrc   
assert_equal(cephes.nbdtrc(1,1,1),0.0) TypeError: function not supported
for these types, and can't coerce to supported types

======================================================================
ERROR: check_nbdtri (scipy.special.basic.test_basic.test_cephes)
----------------------------------------------------------------------
Traceback (most recent call last):
  File
"/home/nico/local/lib/python2.4/site-packages/scipy/special/tests/test_
basic.py", line 313, in check_nbdtri   
assert_equal(cephes.nbdtri(1,1,1),1.0) TypeError: function not supported
for these types, and can't coerce to supported types

======================================================================
ERROR: check_nbdtrin (scipy.special.basic.test_basic.test_cephes)
----------------------------------------------------------------------
Traceback (most recent call last):
  File
"/home/nico/local/lib/python2.4/site-packages/scipy/special/tests/test_
basic.py", line 317, in check_nbdtrin   
assert_equal(cephes.nbdtrin(1,0,0),5.0) TypeError: function not
supported for these types, and can't coerce to supported types

======================================================================
ERROR: check_nctdtr (scipy.special.basic.test_basic.test_cephes)
----------------------------------------------------------------------
Traceback (most recent call last):
  File
"/home/nico/local/lib/python2.4/site-packages/scipy/special/tests/test_
basic.py", line 331, in check_nctdtr   
assert_equal(cephes.nctdtr(1,0,0),0.5) TypeError: function not supported
for these types, and can't coerce to supported types

======================================================================
ERROR: check_nctdtrinc (scipy.special.basic.test_basic.test_cephes)
----------------------------------------------------------------------
Traceback (most recent call last):
  File
"/home/nico/local/lib/python2.4/site-packages/scipy/special/tests/test_
basic.py", line 335, in check_nctdtrinc    cephes.nctdtrinc(1,0,0)
TypeError: function not supported for these types, and can't coerce to
supported types

======================================================================
ERROR: check_nctdtrit (scipy.special.basic.test_basic.test_cephes)
----------------------------------------------------------------------
Traceback (most recent call last):
  File
"/home/nico/local/lib/python2.4/site-packages/scipy/special/tests/test_
basic.py", line 337, in check_nctdtrit    cephes.nctdtrit(.1,0.2,.5)
TypeError: function not supported for these types, and can't coerce to
supported types

======================================================================
ERROR: check_nrdtrimn (scipy.special.basic.test_basic.test_cephes)
----------------------------------------------------------------------
Traceback (most recent call last):
  File
"/home/nico/local/lib/python2.4/site-packages/scipy/special/tests/test_
basic.py", line 344, in check_nrdtrimn   
assert_approx_equal(cephes.nrdtrimn(0.5,1,1),1.0) TypeError: function
not supported for these types, and can't coerce to supported types

======================================================================
ERROR: check_nrdtrisd (scipy.special.basic.test_basic.test_cephes)
----------------------------------------------------------------------
Traceback (most recent call last):
  File
"/home/nico/local/lib/python2.4/site-packages/scipy/special/tests/test_
basic.py", line 346, in check_nrdtrisd   
assert_equal(cephes.nrdtrisd(0.5,0.5,0.5),0.0) TypeError: function not
supported for these types, and can't coerce to supported types

======================================================================
ERROR: check_pbdv (scipy.special.basic.test_basic.test_cephes)
----------------------------------------------------------------------
Traceback (most recent call last):
  File
"/home/nico/local/lib/python2.4/site-packages/scipy/special/tests/test_
basic.py", line 367, in check_pbdv   
assert_equal(cephes.pbdv(1,0),(0.0,0.0)) TypeError: function not
supported for these types, and can't coerce to supported types

======================================================================
ERROR: check_pbvv (scipy.special.basic.test_basic.test_cephes)
----------------------------------------------------------------------
Traceback (most recent call last):
  File
"/home/nico/local/lib/python2.4/site-packages/scipy/special/tests/test_
basic.py", line 369, in check_pbvv    cephes.pbvv(1,0)
TypeError: function not supported for these types, and can't coerce to
supported types

======================================================================
ERROR: check_pbwa (scipy.special.basic.test_basic.test_cephes)
----------------------------------------------------------------------
Traceback (most recent call last):
  File
"/home/nico/local/lib/python2.4/site-packages/scipy/special/tests/test_
basic.py", line 371, in check_pbwa    cephes.pbwa(1,0)
TypeError: function not supported for these types, and can't coerce to
supported types

======================================================================
ERROR: check_radian (scipy.special.basic.test_basic.test_cephes)
----------------------------------------------------------------------
Traceback (most recent call last):
  File
"/home/nico/local/lib/python2.4/site-packages/scipy/special/tests/test_
basic.py", line 401, in check_radian   
assert_equal(cephes.radian(0,0,0),0) TypeError: function not supported
for these types, and can't coerce to supported types

======================================================================
ERROR: check_hyperu (scipy.special.basic.test_basic.test_hyperu)
----------------------------------------------------------------------
Traceback (most recent call last):
  File
"/home/nico/local/lib/python2.4/site-packages/scipy/special/tests/test_
basic.py", line 1158, in check_hyperu    val1 = hyperu(1,0.1,100)
TypeError: function not supported for these types, and can't coerce to
supported types

======================================================================
ERROR: check_lpmv (scipy.special.basic.test_basic.test_lpmv)
----------------------------------------------------------------------
Traceback (most recent call last):
  File
"/home/nico/local/lib/python2.4/site-packages/scipy/special/tests/test_
basic.py", line 1641, in check_lpmv    lp = lpmv(0,2,.5)
TypeError: function not supported for these types, and can't coerce to
supported types

======================================================================
ERROR: check_pbdv (scipy.special.basic.test_basic.test_pbdv)
----------------------------------------------------------------------
Traceback (most recent call last):
  File
"/home/nico/local/lib/python2.4/site-packages/scipy/special/tests/test_
basic.py", line 1711, in check_pbdv    pbv = pbdv(1,.2)
TypeError: function not supported for these types, and can't coerce to
supported types

======================================================================
ERROR: check_radian (scipy.special.basic.test_basic.test_radian)
----------------------------------------------------------------------
Traceback (most recent call last):
  File
"/home/nico/local/lib/python2.4/site-packages/scipy/special/tests/test_
basic.py", line 1753, in check_radian    rad = radian(90,0,0)
TypeError: function not supported for these types, and can't coerce to
supported types

======================================================================
ERROR: check_radianmore (scipy.special.basic.test_basic.test_radian)
----------------------------------------------------------------------
Traceback (most recent call last):
  File
"/home/nico/local/lib/python2.4/site-packages/scipy/special/tests/test_
basic.py", line 1757, in check_radianmore    rad1 = radian(90,1,60)
TypeError: function not supported for these types, and can't coerce to
supported types

======================================================================
ERROR: check_data (scipy.stats.morestats.test_morestats.test_binom_test)
----------------------------------------------------------------------
Traceback (most recent call last):
  File
"/home/nico/local/lib/python2.4/site-packages/scipy/stats/tests/test_mo
restats.py", line 101, in check_data    pval = stats.binom_test(100,250)
  File
"/home/nico/local/lib/python2.4/site-packages/scipy/stats/morestats.py",
line 752, in binom_test    d = distributions.binom.pmf(x,n,p)  File
"/home/nico/local/lib/python2.4/site-packages/scipy/stats/distributions
.py", line 3259, in pmf    insert(output,cond,self._pmf(*goodargs)) 
File
"/home/nico/local/lib/python2.4/site-packages/scipy/stats/distributions
.py", line 3188, in _pmf    return self.cdf(k,*args) -
self.cdf(k-1,*args)  File
"/home/nico/local/lib/python2.4/site-packages/scipy/stats/distributions
.py", line 3287, in cdf    insert(output,cond,self._cdf(*goodargs)) 
File
"/home/nico/local/lib/python2.4/site-packages/scipy/stats/distributions
.py", line 3552, in _cdf    vals = special.bdtr(k,n,pr) TypeError:
function not supported for these types, and can't coerce to supported
types

======================================================================
ERROR: check_data (scipy.stats.morestats.test_morestats.test_levene)
----------------------------------------------------------------------
Traceback (most recent call last):
  File
"/home/nico/local/lib/python2.4/site-packages/scipy/stats/tests/test_mo
restats.py", line 95, in check_data    W, pval = stats.levene(*args)
  File
"/home/nico/local/lib/python2.4/site-packages/scipy/stats/morestats.py",
line 721, in levene    pval = distributions.f.sf(W,k-1,Ntot-k) # 1 - cdf
 File
"/home/nico/local/lib/python2.4/site-packages/scipy/stats/distributions
.py", line 529, in sf    insert(output,cond,self._sf(*goodargs))  File
"/home/nico/local/lib/python2.4/site-packages/scipy/stats/distributions
.py", line 1363, in _sf    return special.fdtrc(dfn, dfd, x) TypeError:
function not supported for these types, and can't coerce to supported
types

======================================================================
ERROR: check_cdf
(scipy.stats.distributions.test_distributions.test_beta)
----------------------------------------------------------------------
Traceback (most recent call last):  File "<string>", line 5, in
check_cdf  File
"/home/nico/local/lib/python2.4/site-packages/scipy/stats/stats.py",
line 1527, in kstest    cdfvals = cdf(vals, *args)  File
"/home/nico/local/lib/python2.4/site-packages/scipy/stats/distributions
.py", line 500, in cdf    insert(output,cond,self._cdf(*goodargs))  File
"/home/nico/local/lib/python2.4/site-packages/scipy/stats/distributions
.py", line 915, in _cdf    return special.btdtr(a,b,x) TypeError:
function not supported for these types, and can't coerce to supported
types

======================================================================
ERROR: check_cdf
(scipy.stats.distributions.test_distributions.test_erlang)
----------------------------------------------------------------------
Traceback (most recent call last):  File "<string>", line 5, in
check_cdf  File
"/home/nico/local/lib/python2.4/site-packages/scipy/stats/stats.py",
line 1527, in kstest    cdfvals = cdf(vals, *args)  File
"/home/nico/local/lib/python2.4/site-packages/scipy/stats/distributions
.py", line 500, in cdf    insert(output,cond,self._cdf(*goodargs))  File
"/home/nico/local/lib/python2.4/site-packages/scipy/stats/distributions
.py", line 1219, in _cdf    return special.gdtr(1.0,n,x) TypeError:
function not supported for these types, and can't coerce to supported
types

======================================================================
ERROR: check_cdf (scipy.stats.distributions.test_distributions.test_f)
----------------------------------------------------------------------
Traceback (most recent call last):
  File "<string>", line 5, in check_cdf
  File
"/home/nico/local/lib/python2.4/site-packages/scipy/stats/stats.py",
line 1527, in kstest    cdfvals = cdf(vals, *args)  File
"/home/nico/local/lib/python2.4/site-packages/scipy/stats/distributions
.py", line 500, in cdf    insert(output,cond,self._cdf(*goodargs))  File
"/home/nico/local/lib/python2.4/site-packages/scipy/stats/distributions
.py", line 1361, in _cdf    return special.fdtr(dfn, dfd, x) TypeError:
function not supported for these types, and can't coerce to supported
types

======================================================================
ERROR: check_cdf (scipy.stats.distributions.test_distributions.test_nct)
----------------------------------------------------------------------
Traceback (most recent call last):
  File "<string>", line 5, in check_cdf
  File
"/home/nico/local/lib/python2.4/site-packages/scipy/stats/stats.py",
line 1527, in kstest    cdfvals = cdf(vals, *args)  File
"/home/nico/local/lib/python2.4/site-packages/scipy/stats/distributions
.py", line 500, in cdf    insert(output,cond,self._cdf(*goodargs))  File
"/home/nico/local/lib/python2.4/site-packages/scipy/stats/distributions
.py", line 2347, in _cdf    return special.nctdtr(df, nc, x) TypeError:
function not supported for these types, and can't coerce to supported
types

======================================================================
ERROR: check_cdf
(scipy.stats.distributions.test_distributions.test_ncx2)
----------------------------------------------------------------------
Traceback (most recent call last):  File "<string>", line 5, in
check_cdf  File
"/home/nico/local/lib/python2.4/site-packages/scipy/stats/stats.py",
line 1527, in kstest    cdfvals = cdf(vals, *args)  File
"/home/nico/local/lib/python2.4/site-packages/scipy/stats/distributions
.py", line 500, in cdf    insert(output,cond,self._cdf(*goodargs))  File
"/home/nico/local/lib/python2.4/site-packages/scipy/stats/distributions
.py", line 2248, in _cdf    return special.chndtr(x,df,nc) TypeError:
function not supported for these types, and can't coerce to supported
types

======================================================================
FAIL: check_simple (scipy.linalg.decomp.test_decomp.test_cholesky)
----------------------------------------------------------------------
Traceback (most recent call last):
  File
"/home/nico/local/lib/python2.4/site-packages/scipy/linalg/tests/test_d
ecomp.py", line 247, in check_simple   
assert_array_almost_equal(Numeric.dot(Numeric.transpose(c),c),a)  File
"/home/nico/local/lib/python2.4/site-packages/scipy_test/testing.py",
line 684, in assert_array_almost_equal    assert cond,\
AssertionError: 
Arrays are not almost equal (mismatch 100.0%):
        Array 1: [[-1885965976648932823  5601654751623046748 
-761725725645001531] [ 5601654751623046748 -5339454195305043312 
358622652...        Array 2: [[8 2 3]
 [2 9 3]
 [3 3 6]]
        

======================================================================
FAIL: check_simple (scipy.linalg.basic.test_basic.test_det)
----------------------------------------------------------------------
Traceback (most recent call last):
  File
"/home/nico/local/lib/python2.4/site-packages/scipy/linalg/tests/test_b
asic.py", line 273, in check_simple    assert_almost_equal(a_det,-2.0)
  File
"/home/nico/local/lib/python2.4/site-packages/scipy_test/testing.py",
line 606, in assert_almost_equal    assert round(abs(desired -
actual),decimal) == 0, msg AssertionError: 
Items are not equal:
DESIRED: -2.0
ACTUAL: inf

======================================================================
FAIL: check_simple (scipy.linalg.basic.test_basic.test_inv)
----------------------------------------------------------------------
Traceback (most recent call last):
  File
"/home/nico/local/lib/python2.4/site-packages/scipy/linalg/tests/test_b
asic.py", line 202, in check_simple    [[1,0],[0,1]])
  File
"/home/nico/local/lib/python2.4/site-packages/scipy_test/testing.py",
line 684, in assert_array_almost_equal    assert cond,\
AssertionError: 
Arrays are not almost equal (mismatch 100.0%):
        Array 1: [[9216616637413720064   -4503599627370496]
 [9207609438158979072   -9007199254740992]]
        Array 2: [[1 0]
 [0 1]]
        

======================================================================
FAIL: check_simple_exact (scipy.linalg.basic.test_basic.test_lstsq)
----------------------------------------------------------------------
Traceback (most recent call last):
  File
"/home/nico/local/lib/python2.4/site-packages/scipy/linalg/tests/test_b
asic.py", line 356, in check_simple_exact   
assert_array_almost_equal(Numeric.matrixmultiply(a,x),b)  File
"/home/nico/local/lib/python2.4/site-packages/scipy_test/testing.py",
line 684, in assert_array_almost_equal    assert cond,\
AssertionError: 
Arrays are not almost equal (mismatch 50.0%):
        Array 1: [0 0]
        Array 2: [1 0]
        

======================================================================
FAIL: check_simple (scipy.linalg.basic.test_basic.test_solve)
----------------------------------------------------------------------
Traceback (most recent call last):
  File
"/home/nico/local/lib/python2.4/site-packages/scipy/linalg/tests/test_b
asic.py", line 74, in check_simple   
assert_array_almost_equal(Numeric.matrixmultiply(a,x),b)  File
"/home/nico/local/lib/python2.4/site-packages/scipy_test/testing.py",
line 684, in assert_array_almost_equal    assert cond,\
AssertionError: 
Arrays are not almost equal (mismatch 100.0%):
        Array 1: [[       nan        nan]
 [       nan        nan]]
        Array 2: [[1 0]
 [0 1]]
        

======================================================================
FAIL: check_simple_sym (scipy.linalg.basic.test_basic.test_solve)
----------------------------------------------------------------------
Traceback (most recent call last):
  File
"/home/nico/local/lib/python2.4/site-packages/scipy/linalg/tests/test_b
asic.py", line 81, in check_simple_sym   
assert_array_almost_equal(Numeric.matrixmultiply(a,x),b)  File
"/home/nico/local/lib/python2.4/site-packages/scipy_test/testing.py",
line 684, in assert_array_almost_equal    assert cond,\
AssertionError: 
Arrays are not almost equal (mismatch 100.0%):
        Array 1: [[       nan        nan]
 [       nan        nan]]
        Array 2: [[1 0]
 [0 1]]
        

======================================================================
FAIL: check_tandg (scipy.special.basic.test_basic.test_cephes)
----------------------------------------------------------------------
Traceback (most recent call last):
  File
"/home/nico/local/lib/python2.4/site-packages/scipy/special/tests/test_
basic.py", line 436, in check_tandg   
assert_equal(cephes.tandg(45),1.0)  File
"/home/nico/local/lib/python2.4/site-packages/scipy_test/testing.py",
line 589, in assert_equal    assert desired == actual, msg
AssertionError:  Items are not equal:
DESIRED: 1.0
ACTUAL: 1.0000000000000002

----------------------------------------------------------------------
Ran 972 tests in 3.504s

FAILED (failures=7, errors=79)



More information about the SciPy-user mailing list