[SciPy-user] Call for testing

Steve Lianoglou lists.steve at arachnedesign.net
Wed Aug 2 13:56:02 CDT 2006


> Thank you all for running the test !
>
> Finally I have disabled ATLAS by
> export ATLAS=None
>
> Good news is that I get the correct result.
> So I guess it's definitely an ATLAS issue.
>
> Bad news is that
> scipy.test(1) results in
>
> FAILED (failures=17, errors=4)
> More details below.

Hi again,

scipy.test(1) only results in two failures for me:

======================================================================
FAIL: check_dot (scipy.lib.tests.test_blas.test_fblas1_simple)
----------------------------------------------------------------------
Traceback (most recent call last):
   File "/opt/local/lib/python2.4/site-packages/scipy/lib/blas/tests/ 
test_blas.py", line 76, in check_dot
     assert_almost_equal(f([3j,-4,3-4j],[2,3,1]),-9+2j)
   File "/opt/local/lib/python2.4/site-packages/numpy/testing/ 
utils.py", line 156, in assert_almost_equal
     assert round(abs(desired - actual),decimal) == 0, msg
AssertionError:
Items are not equal:
ACTUAL: 3.6954854766660471e-37j
DESIRED: (-9+2j)

======================================================================
FAIL: check_dot (scipy.linalg.tests.test_blas.test_fblas1_simple)
----------------------------------------------------------------------
Traceback (most recent call last):
   File "/opt/local/lib/python2.4/site-packages/scipy/linalg/tests/ 
test_blas.py", line 75, in check_dot
     assert_almost_equal(f([3j,-4,3-4j],[2,3,1]),-9+2j)
   File "/opt/local/lib/python2.4/site-packages/numpy/testing/ 
utils.py", line 156, in assert_almost_equal
     assert round(abs(desired - actual),decimal) == 0, msg
AssertionError:
Items are not equal:
ACTUAL: 3.6954890639901157e-37j
DESIRED: (-9+2j)

----------------------------------------------------------------------
Ran 1552 tests in 3.975s

FAILED (failures=2)


-steve


More information about the SciPy-user mailing list