[SciPy-User] problem installing numpy from source

Ryan Krauss ryanlists@gmail....
Sat Jan 7 12:33:46 CST 2012


I haven't installed numpy from source in quite a while (the packages
for ubuntu have quite good for some time).  I am having an
embarrassingly difficult time installing 1.6 from source on my Ubuntu
machine running 10.04 LTS.

The build and install seem to go ok, but when I cd into the final
installation directory, I see the following:

ryan@ryan-hpdv4|12:29 PM|~$ cd /usr/local/lib/python2.6/dist-packages/numpy/
ryan@ryan-hpdv4|12:29 PM|numpy$ ls
add_newdocs.py   __config__.pyc  distutils  f2py
__init__.py   ma          numarray    setup.py        testing
add_newdocs.pyc  core            doc        fft
__init__.pyc  matlib.py   oldnumeric  setup.pyc       tests
compat           ctypeslib.py    dual.py    _import_tools.py   lib
      matlib.pyc  polynomial  setupscons.py   version.py
__config__.py    ctypeslib.pyc   dual.pyc   _import_tools.pyc  linalg
      matrixlib   random      setupscons.pyc  version.pyc
ryan@ryan-hpdv4|12:29 PM|numpy$ ls -alh *.py
-rw-r--r-- 1 root staff 189K 2011-07-20 13:25 add_newdocs.py
-rw-r--r-- 1 root staff 1.6K 2012-01-07 12:27 __config__.py
-rw-r--r-- 1 root staff  14K 2011-07-20 13:25 ctypeslib.py
-rw-r--r-- 1 root staff 1.8K 2011-07-20 13:25 dual.py
-rw-r--r-- 1 root staff  13K 2011-07-20 13:25 _import_tools.py
-rw-r--r-- 1 root staff 4.9K 2011-07-20 13:25 __init__.py
-rw-r--r-- 1 root staff 9.3K 2010-11-21 01:34 matlib.py
-rw-r--r-- 1 root staff  946 2010-11-21 01:34 setup.py
-rw-r--r-- 1 root staff 1.5K 2010-11-21 01:34 setupscons.py
-rw-r--r-- 1 root staff  228 2012-01-07 12:27 version.py

Does it make sense that __init__.py wasn't updated?  Should it not
exist anymore?  Should I have uninstalled the numpy pacakge from the
Ubuntu package manager first?

Thanks,

Ryan

Here is my site.cfg:

[DEFAULT]
library_dirs = /usr/lib
[blas_opt]
libraries = f77blas, cblas, atlas

[lapack_opt]
libraries = lapack, f77blas, cblas, atlas


and here is the output of the build command:
sudo python setup.py build --fcompiler=gnu95

I think it builds correctly, but I can't be sure:

ryan@ryan-hpdv4|12:19 PM|numpy-1.6.1$ sudo python setup.py build
--fcompiler=gnu95
Running from numpy source directory.F2PY Version 2
blas_opt_info:
blas_mkl_info:
  libraries mkl,vml,guide not found in /usr/lib
  NOT AVAILABLE

atlas_blas_threads_info:
Setting PTATLAS=ATLAS
  libraries ptf77blas,ptcblas,atlas not found in /usr/lib/atlas
  libraries ptf77blas,ptcblas,atlas not found in /usr/lib/sse
  libraries ptf77blas,ptcblas,atlas not found in /usr/lib/sse2
  libraries ptf77blas,ptcblas,atlas not found in /usr/lib
  NOT AVAILABLE

atlas_blas_info:
  libraries f77blas,cblas,atlas not found in /usr/lib/atlas
/home/ryan/Downloads/numpy-1.6.1/numpy/distutils/command/config.py:413:
DeprecationWarning:
+++++++++++++++++++++++++++++++++++++++++++++++++
Usage of get_output is deprecated: please do not
use it anymore, and avoid configuration checks
involving running executable on the target machine.
+++++++++++++++++++++++++++++++++++++++++++++++++

  DeprecationWarning)
customize GnuFCompiler
Could not locate executable g77
Could not locate executable f77
customize IntelFCompiler
Could not locate executable ifort
Could not locate executable ifc
customize LaheyFCompiler
Could not locate executable lf95
customize PGroupFCompiler
Could not locate executable pgf90
Could not locate executable pgf77
customize AbsoftFCompiler
Could not locate executable f90
customize NAGFCompiler
Found executable /usr/bin/f95
customize VastFCompiler
customize CompaqFCompiler
Could not locate executable fort
customize IntelItaniumFCompiler
Could not locate executable efort
Could not locate executable efc
customize IntelEM64TFCompiler
customize Gnu95FCompiler
Found executable /usr/bin/gfortran
customize Gnu95FCompiler
customize Gnu95FCompiler using config
compiling '_configtest.c':

/* This file is generated from numpy/distutils/system_info.py */
void ATL_buildinfo(void);
int main(void) {
  ATL_buildinfo();
  return 0;
}
C compiler: gcc -pthread -fno-strict-aliasing -DNDEBUG -g -fwrapv -O2
-Wall -Wstrict-prototypes -fPIC

compile options: '-c'
gcc: _configtest.c
gcc -pthread _configtest.o -L/usr/lib/sse -lf77blas -lcblas -latlas -o
_configtest
ATLAS version 3.6.0 built by root on Fri Jan  9 15:57:20 UTC 2004:
   UNAME    : Linux intech67 2.4.20 #1 SMP Fri Jan 10 18:29:51 EST
2003 i686 GNU/Linux
   INSTFLG  :
   MMDEF    : /fix/g/camm/atlas3-3.6.0/CONFIG/ARCHS/P4SSE2/gcc/gemm
   ARCHDEF  : /fix/g/camm/atlas3-3.6.0/CONFIG/ARCHS/P4SSE2/gcc/misc
   F2CDEFS  : -DAdd__ -DStringSunStyle
   CACHEEDGE: 1048576
   F77      : /usr/bin/g77, version GNU Fortran (GCC) 3.3.3 20031229
(prerelease) (Debian)
   F77FLAGS : -fomit-frame-pointer -O
   CC       : /usr/bin/gcc, version gcc (GCC) 3.3.3 20031229
(prerelease) (Debian)
   CC FLAGS : -fomit-frame-pointer -O3 -funroll-all-loops
   MCC      : /usr/bin/gcc, version gcc (GCC) 3.3.3 20031229
(prerelease) (Debian)
   MCCFLAGS : -fomit-frame-pointer -O
success!
removing: _configtest.c _configtest.o _configtest
  FOUND:
    libraries = ['f77blas', 'cblas', 'atlas']
    library_dirs = ['/usr/lib/sse']
    language = c
    define_macros = [('ATLAS_INFO', '"\\"3.6.0\\""')]
    include_dirs = ['/usr/include']

  FOUND:
    libraries = ['f77blas', 'cblas', 'atlas']
    library_dirs = ['/usr/lib/sse']
    language = c
    define_macros = [('ATLAS_INFO', '"\\"3.6.0\\""')]
    include_dirs = ['/usr/include']

lapack_opt_info:
lapack_mkl_info:
mkl_info:
  libraries mkl,vml,guide not found in /usr/lib
  NOT AVAILABLE

  NOT AVAILABLE

atlas_threads_info:
Setting PTATLAS=ATLAS
  libraries ptf77blas,ptcblas,atlas not found in /usr/lib/atlas
  libraries lapack_atlas not found in /usr/lib/atlas
  libraries ptf77blas,ptcblas,atlas not found in /usr/lib/sse
  libraries ptf77blas,ptcblas,atlas not found in /usr/lib/sse2
  libraries ptf77blas,ptcblas,atlas not found in /usr/lib
numpy.distutils.system_info.atlas_threads_info
  NOT AVAILABLE

atlas_info:
  libraries f77blas,cblas,atlas not found in /usr/lib/atlas
  libraries lapack_atlas not found in /usr/lib/atlas
  libraries lapack not found in /usr/lib/sse
numpy.distutils.system_info.atlas_info
  FOUND:
    libraries = ['lapack', 'f77blas', 'cblas', 'atlas']
    library_dirs = ['/usr/lib/sse/atlas', '/usr/lib/sse']
    language = f77
    define_macros = [('ATLAS_INFO', '"\\"3.6.0\\""')]
    include_dirs = ['/usr/include']

  FOUND:
    libraries = ['lapack', 'f77blas', 'cblas', 'atlas']
    library_dirs = ['/usr/lib/sse/atlas', '/usr/lib/sse']
    language = f77
    define_macros = [('ATLAS_INFO', '"\\"3.6.0\\""')]
    include_dirs = ['/usr/include']

running build
running config_cc
unifing config_cc, config, build_clib, build_ext, build commands
--compiler options
running config_fc
unifing config_fc, config, build_clib, build_ext, build commands
--fcompiler options
running build_src
build_src
building py_modules sources
creating build
creating build/src.linux-i686-2.6
creating build/src.linux-i686-2.6/numpy
creating build/src.linux-i686-2.6/numpy/distutils
building library "npymath" sources
customize Gnu95FCompiler
customize Gnu95FCompiler using config
C compiler: gcc -pthread -fno-strict-aliasing -DNDEBUG -g -fwrapv -O2
-Wall -Wstrict-prototypes -fPIC

compile options: '-Inumpy/core/src/private -Inumpy/core/src
-Inumpy/core -Inumpy/core/src/npymath -Inumpy/core/src/multiarray
-Inumpy/core/src/umath -Inumpy/core/include -I/usr/include/python2.6
-c'
gcc: _configtest.c
gcc -pthread _configtest.o -o _configtest
success!
removing: _configtest.c _configtest.o _configtest
C compiler: gcc -pthread -fno-strict-aliasing -DNDEBUG -g -fwrapv -O2
-Wall -Wstrict-prototypes -fPIC

compile options: '-Inumpy/core/src/private -Inumpy/core/src
-Inumpy/core -Inumpy/core/src/npymath -Inumpy/core/src/multiarray
-Inumpy/core/src/umath -Inumpy/core/include -I/usr/include/python2.6
-c'
gcc: _configtest.c
_configtest.c:1: warning: conflicting types for built-in function ‘exp’
gcc -pthread _configtest.o -o _configtest
_configtest.o: In function `main':
/home/ryan/Downloads/numpy-1.6.1/_configtest.c:6: undefined reference to `exp'
collect2: ld returned 1 exit status
_configtest.o: In function `main':
/home/ryan/Downloads/numpy-1.6.1/_configtest.c:6: undefined reference to `exp'
collect2: ld returned 1 exit status
failure.
removing: _configtest.c _configtest.o
C compiler: gcc -pthread -fno-strict-aliasing -DNDEBUG -g -fwrapv -O2
-Wall -Wstrict-prototypes -fPIC

compile options: '-Inumpy/core/src/private -Inumpy/core/src
-Inumpy/core -Inumpy/core/src/npymath -Inumpy/core/src/multiarray
-Inumpy/core/src/umath -Inumpy/core/include -I/usr/include/python2.6
-c'
gcc: _configtest.c
_configtest.c:1: warning: conflicting types for built-in function ‘exp’
gcc -pthread _configtest.o -lm -o _configtest
success!
removing: _configtest.c _configtest.o _configtest
creating build/src.linux-i686-2.6/numpy/core
creating build/src.linux-i686-2.6/numpy/core/src
creating build/src.linux-i686-2.6/numpy/core/src/npymath
conv_template:> build/src.linux-i686-2.6/numpy/core/src/npymath/npy_math.c
conv_template:> build/src.linux-i686-2.6/numpy/core/src/npymath/ieee754.c
conv_template:>
build/src.linux-i686-2.6/numpy/core/src/npymath/npy_math_complex.c
building extension "numpy.core._sort" sources
Generating build/src.linux-i686-2.6/numpy/core/include/numpy/config.h
C compiler: gcc -pthread -fno-strict-aliasing -DNDEBUG -g -fwrapv -O2
-Wall -Wstrict-prototypes -fPIC

compile options: '-Inumpy/core/src/private -Inumpy/core/src
-Inumpy/core -Inumpy/core/src/npymath -Inumpy/core/src/multiarray
-Inumpy/core/src/umath -Inumpy/core/include -I/usr/include/python2.6
-c'
gcc: _configtest.c
success!
removing: _configtest.c _configtest.o
C compiler: gcc -pthread -fno-strict-aliasing -DNDEBUG -g -fwrapv -O2
-Wall -Wstrict-prototypes -fPIC

compile options: '-Inumpy/core/src/private -Inumpy/core/src
-Inumpy/core -Inumpy/core/src/npymath -Inumpy/core/src/multiarray
-Inumpy/core/src/umath -Inumpy/core/include -I/usr/include/python2.6
-c'
gcc: _configtest.c
success!
removing: _configtest.c _configtest.o
C compiler: gcc -pthread -fno-strict-aliasing -DNDEBUG -g -fwrapv -O2
-Wall -Wstrict-prototypes -fPIC

compile options: '-Inumpy/core/src/private -Inumpy/core/src
-Inumpy/core -Inumpy/core/src/npymath -Inumpy/core/src/multiarray
-Inumpy/core/src/umath -Inumpy/core/include -I/usr/include/python2.6
-c'
gcc: _configtest.c
_configtest.c:5: warning: function declaration isn’t a prototype
success!
removing: _configtest.c _configtest.o
C compiler: gcc -pthread -fno-strict-aliasing -DNDEBUG -g -fwrapv -O2
-Wall -Wstrict-prototypes -fPIC

compile options: '-Inumpy/core/src/private -Inumpy/core/src
-Inumpy/core -Inumpy/core/src/npymath -Inumpy/core/src/multiarray
-Inumpy/core/src/umath -Inumpy/core/include -I/usr/include/python2.6
-c'
gcc: _configtest.c
_configtest.c:5: warning: function declaration isn’t a prototype
success!
removing: _configtest.c _configtest.o
C compiler: gcc -pthread -fno-strict-aliasing -DNDEBUG -g -fwrapv -O2
-Wall -Wstrict-prototypes -fPIC

compile options: '-Inumpy/core/src/private -Inumpy/core/src
-Inumpy/core -Inumpy/core/src/npymath -Inumpy/core/src/multiarray
-Inumpy/core/src/umath -Inumpy/core/include -I/usr/include/python2.6
-c'
gcc: _configtest.c
_configtest.c:5: warning: function declaration isn’t a prototype
success!
removing: _configtest.c _configtest.o
C compiler: gcc -pthread -fno-strict-aliasing -DNDEBUG -g -fwrapv -O2
-Wall -Wstrict-prototypes -fPIC

compile options: '-Inumpy/core/src/private -Inumpy/core/src
-Inumpy/core -Inumpy/core/src/npymath -Inumpy/core/src/multiarray
-Inumpy/core/src/umath -Inumpy/core/include -I/usr/include/python2.6
-c'
gcc: _configtest.c
_configtest.c:5: warning: function declaration isn’t a prototype
success!
removing: _configtest.c _configtest.o
C compiler: gcc -pthread -fno-strict-aliasing -DNDEBUG -g -fwrapv -O2
-Wall -Wstrict-prototypes -fPIC

compile options: '-Inumpy/core/src/private -Inumpy/core/src
-Inumpy/core -Inumpy/core/src/npymath -Inumpy/core/src/multiarray
-Inumpy/core/src/umath -Inumpy/core/include -I/usr/include/python2.6
-c'
gcc: _configtest.c
_configtest.c:4: warning: function declaration isn’t a prototype
removing: _configtest.c _configtest.o
C compiler: gcc -pthread -fno-strict-aliasing -DNDEBUG -g -fwrapv -O2
-Wall -Wstrict-prototypes -fPIC

compile options: '-Inumpy/core/src/private -Inumpy/core/src
-Inumpy/core -Inumpy/core/src/npymath -Inumpy/core/src/multiarray
-Inumpy/core/src/umath -Inumpy/core/include -I/usr/include/python2.6
-c'
gcc: _configtest.c
_configtest.c:4: warning: function declaration isn’t a prototype
removing: _configtest.c _configtest.o
C compiler: gcc -pthread -fno-strict-aliasing -DNDEBUG -g -fwrapv -O2
-Wall -Wstrict-prototypes -fPIC

compile options: '-Inumpy/core/src/private -Inumpy/core/src
-Inumpy/core -Inumpy/core/src/npymath -Inumpy/core/src/multiarray
-Inumpy/core/src/umath -Inumpy/core/include -I/usr/include/python2.6
-c'
gcc: _configtest.c
_configtest.c:4: warning: function declaration isn’t a prototype
removing: _configtest.c _configtest.o
C compiler: gcc -pthread -fno-strict-aliasing -DNDEBUG -g -fwrapv -O2
-Wall -Wstrict-prototypes -fPIC

compile options: '-Inumpy/core/src/private -Inumpy/core/src
-Inumpy/core -Inumpy/core/src/npymath -Inumpy/core/src/multiarray
-Inumpy/core/src/umath -Inumpy/core/include -I/usr/include/python2.6
-c'
gcc: _configtest.c
_configtest.c:4: warning: function declaration isn’t a prototype
_configtest.c: In function ‘main’:
_configtest.c:5: error: size of array ‘test_array’ is negative
_configtest.c:4: warning: function declaration isn’t a prototype
_configtest.c: In function ‘main’:
_configtest.c:5: error: size of array ‘test_array’ is negative
C compiler: gcc -pthread -fno-strict-aliasing -DNDEBUG -g -fwrapv -O2
-Wall -Wstrict-prototypes -fPIC

compile options: '-Inumpy/core/src/private -Inumpy/core/src
-Inumpy/core -Inumpy/core/src/npymath -Inumpy/core/src/multiarray
-Inumpy/core/src/umath -Inumpy/core/include -I/usr/include/python2.6
-c'
gcc: _configtest.c
_configtest.c:4: warning: function declaration isn’t a prototype
_configtest.c: In function ‘main’:
_configtest.c:5: error: size of array ‘test_array’ is negative
_configtest.c:4: warning: function declaration isn’t a prototype
_configtest.c: In function ‘main’:
_configtest.c:5: error: size of array ‘test_array’ is negative
C compiler: gcc -pthread -fno-strict-aliasing -DNDEBUG -g -fwrapv -O2
-Wall -Wstrict-prototypes -fPIC

compile options: '-Inumpy/core/src/private -Inumpy/core/src
-Inumpy/core -Inumpy/core/src/npymath -Inumpy/core/src/multiarray
-Inumpy/core/src/umath -Inumpy/core/include -I/usr/include/python2.6
-c'
gcc: _configtest.c
_configtest.c:4: warning: function declaration isn’t a prototype
_configtest.c: In function ‘main’:
_configtest.c:5: error: size of array ‘test_array’ is negative
_configtest.c:4: warning: function declaration isn’t a prototype
_configtest.c: In function ‘main’:
_configtest.c:5: error: size of array ‘test_array’ is negative
C compiler: gcc -pthread -fno-strict-aliasing -DNDEBUG -g -fwrapv -O2
-Wall -Wstrict-prototypes -fPIC

compile options: '-Inumpy/core/src/private -Inumpy/core/src
-Inumpy/core -Inumpy/core/src/npymath -Inumpy/core/src/multiarray
-Inumpy/core/src/umath -Inumpy/core/include -I/usr/include/python2.6
-c'
gcc: _configtest.c
_configtest.c:4: warning: function declaration isn’t a prototype
_configtest.c: In function ‘main’:
_configtest.c:5: error: size of array ‘test_array’ is negative
_configtest.c:4: warning: function declaration isn’t a prototype
_configtest.c: In function ‘main’:
_configtest.c:5: error: size of array ‘test_array’ is negative
C compiler: gcc -pthread -fno-strict-aliasing -DNDEBUG -g -fwrapv -O2
-Wall -Wstrict-prototypes -fPIC

compile options: '-Inumpy/core/src/private -Inumpy/core/src
-Inumpy/core -Inumpy/core/src/npymath -Inumpy/core/src/multiarray
-Inumpy/core/src/umath -Inumpy/core/include -I/usr/include/python2.6
-c'
gcc: _configtest.c
_configtest.c:4: warning: function declaration isn’t a prototype
_configtest.c: In function ‘main’:
_configtest.c:5: error: size of array ‘test_array’ is negative
_configtest.c:4: warning: function declaration isn’t a prototype
_configtest.c: In function ‘main’:
_configtest.c:5: error: size of array ‘test_array’ is negative
C compiler: gcc -pthread -fno-strict-aliasing -DNDEBUG -g -fwrapv -O2
-Wall -Wstrict-prototypes -fPIC

compile options: '-Inumpy/core/src/private -Inumpy/core/src
-Inumpy/core -Inumpy/core/src/npymath -Inumpy/core/src/multiarray
-Inumpy/core/src/umath -Inumpy/core/include -I/usr/include/python2.6
-c'
gcc: _configtest.c
_configtest.c:4: warning: function declaration isn’t a prototype
_configtest.c: In function ‘main’:
_configtest.c:5: error: size of array ‘test_array’ is negative
_configtest.c:4: warning: function declaration isn’t a prototype
_configtest.c: In function ‘main’:
_configtest.c:5: error: size of array ‘test_array’ is negative
C compiler: gcc -pthread -fno-strict-aliasing -DNDEBUG -g -fwrapv -O2
-Wall -Wstrict-prototypes -fPIC

compile options: '-Inumpy/core/src/private -Inumpy/core/src
-Inumpy/core -Inumpy/core/src/npymath -Inumpy/core/src/multiarray
-Inumpy/core/src/umath -Inumpy/core/include -I/usr/include/python2.6
-c'
gcc: _configtest.c
_configtest.c:4: warning: function declaration isn’t a prototype
removing: _configtest.c _configtest.o _configtest.c _configtest.o
_configtest.c _configtest.o _configtest.c _configtest.o _configtest.c
_configtest.o _configtest.c _configtest.o _configtest.c _configtest.o
C compiler: gcc -pthread -fno-strict-aliasing -DNDEBUG -g -fwrapv -O2
-Wall -Wstrict-prototypes -fPIC

compile options: '-Inumpy/core/src/private -Inumpy/core/src
-Inumpy/core -Inumpy/core/src/npymath -Inumpy/core/src/multiarray
-Inumpy/core/src/umath -Inumpy/core/include -I/usr/include/python2.6
-c'
gcc: _configtest.c
_configtest.c:4: warning: function declaration isn’t a prototype
removing: _configtest.c _configtest.o
C compiler: gcc -pthread -fno-strict-aliasing -DNDEBUG -g -fwrapv -O2
-Wall -Wstrict-prototypes -fPIC

compile options: '-Inumpy/core/src/private -Inumpy/core/src
-Inumpy/core -Inumpy/core/src/npymath -Inumpy/core/src/multiarray
-Inumpy/core/src/umath -Inumpy/core/include -I/usr/include/python2.6
-c'
gcc: _configtest.c
_configtest.c:4: warning: function declaration isn’t a prototype
removing: _configtest.c _configtest.o
C compiler: gcc -pthread -fno-strict-aliasing -DNDEBUG -g -fwrapv -O2
-Wall -Wstrict-prototypes -fPIC

compile options: '-Inumpy/core/src/private -Inumpy/core/src
-Inumpy/core -Inumpy/core/src/npymath -Inumpy/core/src/multiarray
-Inumpy/core/src/umath -Inumpy/core/include -I/usr/include/python2.6
-c'
gcc: _configtest.c
_configtest.c:4: warning: function declaration isn’t a prototype
removing: _configtest.c _configtest.o
C compiler: gcc -pthread -fno-strict-aliasing -DNDEBUG -g -fwrapv -O2
-Wall -Wstrict-prototypes -fPIC

compile options: '-Inumpy/core/src/private -Inumpy/core/src
-Inumpy/core -Inumpy/core/src/npymath -Inumpy/core/src/multiarray
-Inumpy/core/src/umath -Inumpy/core/include -I/usr/include/python2.6
-c'
gcc: _configtest.c
_configtest.c:5: warning: function declaration isn’t a prototype
success!
removing: _configtest.c _configtest.o
C compiler: gcc -pthread -fno-strict-aliasing -DNDEBUG -g -fwrapv -O2
-Wall -Wstrict-prototypes -fPIC

compile options: '-Inumpy/core/src/private -Inumpy/core/src
-Inumpy/core -Inumpy/core/src/npymath -Inumpy/core/src/multiarray
-Inumpy/core/src/umath -Inumpy/core/include -I/usr/include/python2.6
-c'
gcc: _configtest.c
_configtest.c:4: warning: function declaration isn’t a prototype
removing: _configtest.c _configtest.o
C compiler: gcc -pthread -fno-strict-aliasing -DNDEBUG -g -fwrapv -O2
-Wall -Wstrict-prototypes -fPIC

compile options: '-Inumpy/core/src/private -Inumpy/core/src
-Inumpy/core -Inumpy/core/src/npymath -Inumpy/core/src/multiarray
-Inumpy/core/src/umath -Inumpy/core/include -I/usr/include/python2.6
-c'
gcc: _configtest.c
_configtest.c:4: warning: function declaration isn’t a prototype
removing: _configtest.c _configtest.o
C compiler: gcc -pthread -fno-strict-aliasing -DNDEBUG -g -fwrapv -O2
-Wall -Wstrict-prototypes -fPIC

compile options: '-Inumpy/core/src/private -Inumpy/core/src
-Inumpy/core -Inumpy/core/src/npymath -Inumpy/core/src/multiarray
-Inumpy/core/src/umath -Inumpy/core/include -I/usr/include/python2.6
-c'
gcc: _configtest.c
_configtest.c:4: warning: function declaration isn’t a prototype
removing: _configtest.c _configtest.o
C compiler: gcc -pthread -fno-strict-aliasing -DNDEBUG -g -fwrapv -O2
-Wall -Wstrict-prototypes -fPIC

compile options: '-Inumpy/core/src/private -Inumpy/core/src
-Inumpy/core -Inumpy/core/src/npymath -Inumpy/core/src/multiarray
-Inumpy/core/src/umath -Inumpy/core/include -I/usr/include/python2.6
-c'
gcc: _configtest.c
_configtest.c:4: warning: function declaration isn’t a prototype
_configtest.c: In function ‘main’:
_configtest.c:5: error: size of array ‘test_array’ is negative
_configtest.c:4: warning: function declaration isn’t a prototype
_configtest.c: In function ‘main’:
_configtest.c:5: error: size of array ‘test_array’ is negative
C compiler: gcc -pthread -fno-strict-aliasing -DNDEBUG -g -fwrapv -O2
-Wall -Wstrict-prototypes -fPIC

compile options: '-Inumpy/core/src/private -Inumpy/core/src
-Inumpy/core -Inumpy/core/src/npymath -Inumpy/core/src/multiarray
-Inumpy/core/src/umath -Inumpy/core/include -I/usr/include/python2.6
-c'
gcc: _configtest.c
_configtest.c:4: warning: function declaration isn’t a prototype
_configtest.c: In function ‘main’:
_configtest.c:5: error: size of array ‘test_array’ is negative
_configtest.c:4: warning: function declaration isn’t a prototype
_configtest.c: In function ‘main’:
_configtest.c:5: error: size of array ‘test_array’ is negative
C compiler: gcc -pthread -fno-strict-aliasing -DNDEBUG -g -fwrapv -O2
-Wall -Wstrict-prototypes -fPIC

compile options: '-Inumpy/core/src/private -Inumpy/core/src
-Inumpy/core -Inumpy/core/src/npymath -Inumpy/core/src/multiarray
-Inumpy/core/src/umath -Inumpy/core/include -I/usr/include/python2.6
-c'
gcc: _configtest.c
_configtest.c:4: warning: function declaration isn’t a prototype
_configtest.c: In function ‘main’:
_configtest.c:5: error: size of array ‘test_array’ is negative
_configtest.c:4: warning: function declaration isn’t a prototype
_configtest.c: In function ‘main’:
_configtest.c:5: error: size of array ‘test_array’ is negative
C compiler: gcc -pthread -fno-strict-aliasing -DNDEBUG -g -fwrapv -O2
-Wall -Wstrict-prototypes -fPIC

compile options: '-Inumpy/core/src/private -Inumpy/core/src
-Inumpy/core -Inumpy/core/src/npymath -Inumpy/core/src/multiarray
-Inumpy/core/src/umath -Inumpy/core/include -I/usr/include/python2.6
-c'
gcc: _configtest.c
_configtest.c:4: warning: function declaration isn’t a prototype
_configtest.c: In function ‘main’:
_configtest.c:5: error: size of array ‘test_array’ is negative
_configtest.c:4: warning: function declaration isn’t a prototype
_configtest.c: In function ‘main’:
_configtest.c:5: error: size of array ‘test_array’ is negative
C compiler: gcc -pthread -fno-strict-aliasing -DNDEBUG -g -fwrapv -O2
-Wall -Wstrict-prototypes -fPIC

compile options: '-Inumpy/core/src/private -Inumpy/core/src
-Inumpy/core -Inumpy/core/src/npymath -Inumpy/core/src/multiarray
-Inumpy/core/src/umath -Inumpy/core/include -I/usr/include/python2.6
-c'
gcc: _configtest.c
_configtest.c:4: warning: function declaration isn’t a prototype
_configtest.c: In function ‘main’:
_configtest.c:5: error: size of array ‘test_array’ is negative
_configtest.c:4: warning: function declaration isn’t a prototype
_configtest.c: In function ‘main’:
_configtest.c:5: error: size of array ‘test_array’ is negative
C compiler: gcc -pthread -fno-strict-aliasing -DNDEBUG -g -fwrapv -O2
-Wall -Wstrict-prototypes -fPIC

compile options: '-Inumpy/core/src/private -Inumpy/core/src
-Inumpy/core -Inumpy/core/src/npymath -Inumpy/core/src/multiarray
-Inumpy/core/src/umath -Inumpy/core/include -I/usr/include/python2.6
-c'
gcc: _configtest.c
_configtest.c:4: warning: function declaration isn’t a prototype
_configtest.c: In function ‘main’:
_configtest.c:5: error: size of array ‘test_array’ is negative
_configtest.c:4: warning: function declaration isn’t a prototype
_configtest.c: In function ‘main’:
_configtest.c:5: error: size of array ‘test_array’ is negative
C compiler: gcc -pthread -fno-strict-aliasing -DNDEBUG -g -fwrapv -O2
-Wall -Wstrict-prototypes -fPIC

compile options: '-Inumpy/core/src/private -Inumpy/core/src
-Inumpy/core -Inumpy/core/src/npymath -Inumpy/core/src/multiarray
-Inumpy/core/src/umath -Inumpy/core/include -I/usr/include/python2.6
-c'
gcc: _configtest.c
_configtest.c:4: warning: function declaration isn’t a prototype
_configtest.c: In function ‘main’:
_configtest.c:5: error: size of array ‘test_array’ is negative
_configtest.c:4: warning: function declaration isn’t a prototype
_configtest.c: In function ‘main’:
_configtest.c:5: error: size of array ‘test_array’ is negative
C compiler: gcc -pthread -fno-strict-aliasing -DNDEBUG -g -fwrapv -O2
-Wall -Wstrict-prototypes -fPIC

compile options: '-Inumpy/core/src/private -Inumpy/core/src
-Inumpy/core -Inumpy/core/src/npymath -Inumpy/core/src/multiarray
-Inumpy/core/src/umath -Inumpy/core/include -I/usr/include/python2.6
-c'
gcc: _configtest.c
_configtest.c:4: warning: function declaration isn’t a prototype
removing: _configtest.c _configtest.o _configtest.c _configtest.o
_configtest.c _configtest.o _configtest.c _configtest.o _configtest.c
_configtest.o _configtest.c _configtest.o _configtest.c _configtest.o
_configtest.c _configtest.o
C compiler: gcc -pthread -fno-strict-aliasing -DNDEBUG -g -fwrapv -O2
-Wall -Wstrict-prototypes -fPIC

compile options: '-Inumpy/core/src/private -Inumpy/core/src
-Inumpy/core -Inumpy/core/src/npymath -Inumpy/core/src/multiarray
-Inumpy/core/src/umath -Inumpy/core/include -I/usr/include/python2.6
-c'
gcc: _configtest.c
_configtest.c:4: warning: function declaration isn’t a prototype
removing: _configtest.c _configtest.o
C compiler: gcc -pthread -fno-strict-aliasing -DNDEBUG -g -fwrapv -O2
-Wall -Wstrict-prototypes -fPIC

compile options: '-Inumpy/core/src/private -Inumpy/core/src
-Inumpy/core -Inumpy/core/src/npymath -Inumpy/core/src/multiarray
-Inumpy/core/src/umath -Inumpy/core/include -I/usr/include/python2.6
-c'
gcc: _configtest.c
_configtest.c:4: warning: function declaration isn’t a prototype
removing: _configtest.c _configtest.o
C compiler: gcc -pthread -fno-strict-aliasing -DNDEBUG -g -fwrapv -O2
-Wall -Wstrict-prototypes -fPIC

compile options: '-Inumpy/core/src/private -Inumpy/core/src
-Inumpy/core -Inumpy/core/src/npymath -Inumpy/core/src/multiarray
-Inumpy/core/src/umath -Inumpy/core/include -I/usr/include/python2.6
-c'
gcc: _configtest.c
_configtest.c:4: warning: function declaration isn’t a prototype
removing: _configtest.c _configtest.o
C compiler: gcc -pthread -fno-strict-aliasing -DNDEBUG -g -fwrapv -O2
-Wall -Wstrict-prototypes -fPIC

compile options: '-Inumpy/core/src/private -Inumpy/core/src
-Inumpy/core -Inumpy/core/src/npymath -Inumpy/core/src/multiarray
-Inumpy/core/src/umath -Inumpy/core/include -I/usr/include/python2.6
-c'
gcc: _configtest.c
_configtest.c:4: warning: function declaration isn’t a prototype
removing: _configtest.c _configtest.o
C compiler: gcc -pthread -fno-strict-aliasing -DNDEBUG -g -fwrapv -O2
-Wall -Wstrict-prototypes -fPIC

compile options: '-Inumpy/core/src/private -Inumpy/core/src
-Inumpy/core -Inumpy/core/src/npymath -Inumpy/core/src/multiarray
-Inumpy/core/src/umath -Inumpy/core/include -I/usr/include/python2.6
-c'
gcc: _configtest.c
_configtest.c:5: warning: function declaration isn’t a prototype
_configtest.c: In function ‘main’:
_configtest.c:7: error: ‘SIZEOF_LONGDOUBLE’ undeclared (first use in
this function)
_configtest.c:7: error: (Each undeclared identifier is reported only once
_configtest.c:7: error: for each function it appears in.)
_configtest.c:5: warning: function declaration isn’t a prototype
_configtest.c: In function ‘main’:
_configtest.c:7: error: ‘SIZEOF_LONGDOUBLE’ undeclared (first use in
this function)
_configtest.c:7: error: (Each undeclared identifier is reported only once
_configtest.c:7: error: for each function it appears in.)
failure.
removing: _configtest.c _configtest.o
C compiler: gcc -pthread -fno-strict-aliasing -DNDEBUG -g -fwrapv -O2
-Wall -Wstrict-prototypes -fPIC

compile options: '-Inumpy/core/src/private -Inumpy/core/src
-Inumpy/core -Inumpy/core/src/npymath -Inumpy/core/src/multiarray
-Inumpy/core/src/umath -Inumpy/core/include -I/usr/include/python2.6
-c'
gcc: _configtest.c
_configtest.c:4: warning: function declaration isn’t a prototype
removing: _configtest.c _configtest.o
C compiler: gcc -pthread -fno-strict-aliasing -DNDEBUG -g -fwrapv -O2
-Wall -Wstrict-prototypes -fPIC

compile options: '-Inumpy/core/src/private -Inumpy/core/src
-Inumpy/core -Inumpy/core/src/npymath -Inumpy/core/src/multiarray
-Inumpy/core/src/umath -Inumpy/core/include -I/usr/include/python2.6
-c'
gcc: _configtest.c
_configtest.c:4: warning: function declaration isn’t a prototype
_configtest.c: In function ‘main’:
_configtest.c:5: error: size of array ‘test_array’ is negative
_configtest.c:4: warning: function declaration isn’t a prototype
_configtest.c: In function ‘main’:
_configtest.c:5: error: size of array ‘test_array’ is negative
C compiler: gcc -pthread -fno-strict-aliasing -DNDEBUG -g -fwrapv -O2
-Wall -Wstrict-prototypes -fPIC

compile options: '-Inumpy/core/src/private -Inumpy/core/src
-Inumpy/core -Inumpy/core/src/npymath -Inumpy/core/src/multiarray
-Inumpy/core/src/umath -Inumpy/core/include -I/usr/include/python2.6
-c'
gcc: _configtest.c
_configtest.c:4: warning: function declaration isn’t a prototype
removing: _configtest.c _configtest.o _configtest.c _configtest.o
C compiler: gcc -pthread -fno-strict-aliasing -DNDEBUG -g -fwrapv -O2
-Wall -Wstrict-prototypes -fPIC

compile options: '-Inumpy/core/src/private -Inumpy/core/src
-Inumpy/core -Inumpy/core/src/npymath -Inumpy/core/src/multiarray
-Inumpy/core/src/umath -Inumpy/core/include -I/usr/include/python2.6
-c'
gcc: _configtest.c
_configtest.c:4: warning: function declaration isn’t a prototype
removing: _configtest.c _configtest.o
C compiler: gcc -pthread -fno-strict-aliasing -DNDEBUG -g -fwrapv -O2
-Wall -Wstrict-prototypes -fPIC

compile options: '-Inumpy/core/src/private -Inumpy/core/src
-Inumpy/core -Inumpy/core/src/npymath -Inumpy/core/src/multiarray
-Inumpy/core/src/umath -Inumpy/core/include -I/usr/include/python2.6
-c'
gcc: _configtest.c
_configtest.c:4: warning: function declaration isn’t a prototype
_configtest.c: In function ‘main’:
_configtest.c:5: error: size of array ‘test_array’ is negative
_configtest.c:4: warning: function declaration isn’t a prototype
_configtest.c: In function ‘main’:
_configtest.c:5: error: size of array ‘test_array’ is negative
C compiler: gcc -pthread -fno-strict-aliasing -DNDEBUG -g -fwrapv -O2
-Wall -Wstrict-prototypes -fPIC

compile options: '-Inumpy/core/src/private -Inumpy/core/src
-Inumpy/core -Inumpy/core/src/npymath -Inumpy/core/src/multiarray
-Inumpy/core/src/umath -Inumpy/core/include -I/usr/include/python2.6
-c'
gcc: _configtest.c
_configtest.c:4: warning: function declaration isn’t a prototype
_configtest.c: In function ‘main’:
_configtest.c:5: error: size of array ‘test_array’ is negative
_configtest.c:4: warning: function declaration isn’t a prototype
_configtest.c: In function ‘main’:
_configtest.c:5: error: size of array ‘test_array’ is negative
C compiler: gcc -pthread -fno-strict-aliasing -DNDEBUG -g -fwrapv -O2
-Wall -Wstrict-prototypes -fPIC

compile options: '-Inumpy/core/src/private -Inumpy/core/src
-Inumpy/core -Inumpy/core/src/npymath -Inumpy/core/src/multiarray
-Inumpy/core/src/umath -Inumpy/core/include -I/usr/include/python2.6
-c'
gcc: _configtest.c
_configtest.c:4: warning: function declaration isn’t a prototype
_configtest.c: In function ‘main’:
_configtest.c:5: error: size of array ‘test_array’ is negative
_configtest.c:4: warning: function declaration isn’t a prototype
_configtest.c: In function ‘main’:
_configtest.c:5: error: size of array ‘test_array’ is negative
C compiler: gcc -pthread -fno-strict-aliasing -DNDEBUG -g -fwrapv -O2
-Wall -Wstrict-prototypes -fPIC

compile options: '-Inumpy/core/src/private -Inumpy/core/src
-Inumpy/core -Inumpy/core/src/npymath -Inumpy/core/src/multiarray
-Inumpy/core/src/umath -Inumpy/core/include -I/usr/include/python2.6
-c'
gcc: _configtest.c
_configtest.c:4: warning: function declaration isn’t a prototype
_configtest.c: In function ‘main’:
_configtest.c:5: error: size of array ‘test_array’ is negative
_configtest.c:4: warning: function declaration isn’t a prototype
_configtest.c: In function ‘main’:
_configtest.c:5: error: size of array ‘test_array’ is negative
C compiler: gcc -pthread -fno-strict-aliasing -DNDEBUG -g -fwrapv -O2
-Wall -Wstrict-prototypes -fPIC

compile options: '-Inumpy/core/src/private -Inumpy/core/src
-Inumpy/core -Inumpy/core/src/npymath -Inumpy/core/src/multiarray
-Inumpy/core/src/umath -Inumpy/core/include -I/usr/include/python2.6
-c'
gcc: _configtest.c
_configtest.c:4: warning: function declaration isn’t a prototype
_configtest.c: In function ‘main’:
_configtest.c:5: error: size of array ‘test_array’ is negative
_configtest.c:4: warning: function declaration isn’t a prototype
_configtest.c: In function ‘main’:
_configtest.c:5: error: size of array ‘test_array’ is negative
C compiler: gcc -pthread -fno-strict-aliasing -DNDEBUG -g -fwrapv -O2
-Wall -Wstrict-prototypes -fPIC

compile options: '-Inumpy/core/src/private -Inumpy/core/src
-Inumpy/core -Inumpy/core/src/npymath -Inumpy/core/src/multiarray
-Inumpy/core/src/umath -Inumpy/core/include -I/usr/include/python2.6
-c'
gcc: _configtest.c
_configtest.c:4: warning: function declaration isn’t a prototype
_configtest.c: In function ‘main’:
_configtest.c:5: error: size of array ‘test_array’ is negative
_configtest.c:4: warning: function declaration isn’t a prototype
_configtest.c: In function ‘main’:
_configtest.c:5: error: size of array ‘test_array’ is negative
C compiler: gcc -pthread -fno-strict-aliasing -DNDEBUG -g -fwrapv -O2
-Wall -Wstrict-prototypes -fPIC

compile options: '-Inumpy/core/src/private -Inumpy/core/src
-Inumpy/core -Inumpy/core/src/npymath -Inumpy/core/src/multiarray
-Inumpy/core/src/umath -Inumpy/core/include -I/usr/include/python2.6
-c'
gcc: _configtest.c
_configtest.c:4: warning: function declaration isn’t a prototype
_configtest.c: In function ‘main’:
_configtest.c:5: error: size of array ‘test_array’ is negative
_configtest.c:4: warning: function declaration isn’t a prototype
_configtest.c: In function ‘main’:
_configtest.c:5: error: size of array ‘test_array’ is negative
C compiler: gcc -pthread -fno-strict-aliasing -DNDEBUG -g -fwrapv -O2
-Wall -Wstrict-prototypes -fPIC

compile options: '-Inumpy/core/src/private -Inumpy/core/src
-Inumpy/core -Inumpy/core/src/npymath -Inumpy/core/src/multiarray
-Inumpy/core/src/umath -Inumpy/core/include -I/usr/include/python2.6
-c'
gcc: _configtest.c
_configtest.c:4: warning: function declaration isn’t a prototype
_configtest.c: In function ‘main’:
_configtest.c:5: error: size of array ‘test_array’ is negative
_configtest.c:4: warning: function declaration isn’t a prototype
_configtest.c: In function ‘main’:
_configtest.c:5: error: size of array ‘test_array’ is negative
C compiler: gcc -pthread -fno-strict-aliasing -DNDEBUG -g -fwrapv -O2
-Wall -Wstrict-prototypes -fPIC

compile options: '-Inumpy/core/src/private -Inumpy/core/src
-Inumpy/core -Inumpy/core/src/npymath -Inumpy/core/src/multiarray
-Inumpy/core/src/umath -Inumpy/core/include -I/usr/include/python2.6
-c'
gcc: _configtest.c
_configtest.c:4: warning: function declaration isn’t a prototype
_configtest.c: In function ‘main’:
_configtest.c:5: error: size of array ‘test_array’ is negative
_configtest.c:4: warning: function declaration isn’t a prototype
_configtest.c: In function ‘main’:
_configtest.c:5: error: size of array ‘test_array’ is negative
C compiler: gcc -pthread -fno-strict-aliasing -DNDEBUG -g -fwrapv -O2
-Wall -Wstrict-prototypes -fPIC

compile options: '-Inumpy/core/src/private -Inumpy/core/src
-Inumpy/core -Inumpy/core/src/npymath -Inumpy/core/src/multiarray
-Inumpy/core/src/umath -Inumpy/core/include -I/usr/include/python2.6
-c'
gcc: _configtest.c
_configtest.c:4: warning: function declaration isn’t a prototype
_configtest.c: In function ‘main’:
_configtest.c:5: error: size of array ‘test_array’ is negative
_configtest.c:4: warning: function declaration isn’t a prototype
_configtest.c: In function ‘main’:
_configtest.c:5: error: size of array ‘test_array’ is negative
C compiler: gcc -pthread -fno-strict-aliasing -DNDEBUG -g -fwrapv -O2
-Wall -Wstrict-prototypes -fPIC

compile options: '-Inumpy/core/src/private -Inumpy/core/src
-Inumpy/core -Inumpy/core/src/npymath -Inumpy/core/src/multiarray
-Inumpy/core/src/umath -Inumpy/core/include -I/usr/include/python2.6
-c'
gcc: _configtest.c
_configtest.c:4: warning: function declaration isn’t a prototype
_configtest.c: In function ‘main’:
_configtest.c:5: error: size of array ‘test_array’ is negative
_configtest.c:4: warning: function declaration isn’t a prototype
_configtest.c: In function ‘main’:
_configtest.c:5: error: size of array ‘test_array’ is negative
C compiler: gcc -pthread -fno-strict-aliasing -DNDEBUG -g -fwrapv -O2
-Wall -Wstrict-prototypes -fPIC

compile options: '-Inumpy/core/src/private -Inumpy/core/src
-Inumpy/core -Inumpy/core/src/npymath -Inumpy/core/src/multiarray
-Inumpy/core/src/umath -Inumpy/core/include -I/usr/include/python2.6
-c'
gcc: _configtest.c
_configtest.c:4: warning: function declaration isn’t a prototype
removing: _configtest.c _configtest.o _configtest.c _configtest.o
_configtest.c _configtest.o _configtest.c _configtest.o _configtest.c
_configtest.o _configtest.c _configtest.o _configtest.c _configtest.o
_configtest.c _configtest.o _configtest.c _configtest.o _configtest.c
_configtest.o _configtest.c _configtest.o _configtest.c _configtest.o
C compiler: gcc -pthread -fno-strict-aliasing -DNDEBUG -g -fwrapv -O2
-Wall -Wstrict-prototypes -fPIC

compile options: '-Inumpy/core/src/private -Inumpy/core/src
-Inumpy/core -Inumpy/core/src/npymath -Inumpy/core/src/multiarray
-Inumpy/core/src/umath -Inumpy/core/include -I/usr/include/python2.6
-c'
gcc: _configtest.c
_configtest.c:4: warning: function declaration isn’t a prototype
_configtest.c: In function ‘main’:
_configtest.c:5: error: size of array ‘test_array’ is negative
_configtest.c:4: warning: function declaration isn’t a prototype
_configtest.c: In function ‘main’:
_configtest.c:5: error: size of array ‘test_array’ is negative
C compiler: gcc -pthread -fno-strict-aliasing -DNDEBUG -g -fwrapv -O2
-Wall -Wstrict-prototypes -fPIC

compile options: '-Inumpy/core/src/private -Inumpy/core/src
-Inumpy/core -Inumpy/core/src/npymath -Inumpy/core/src/multiarray
-Inumpy/core/src/umath -Inumpy/core/include -I/usr/include/python2.6
-c'
gcc: _configtest.c
_configtest.c:4: warning: function declaration isn’t a prototype
removing: _configtest.c _configtest.o _configtest.c _configtest.o
C compiler: gcc -pthread -fno-strict-aliasing -DNDEBUG -g -fwrapv -O2
-Wall -Wstrict-prototypes -fPIC

compile options: '-Inumpy/core/src/private -Inumpy/core/src
-Inumpy/core -Inumpy/core/src/npymath -Inumpy/core/src/multiarray
-Inumpy/core/src/umath -Inumpy/core/include -I/usr/include/python2.6
-c'
gcc: _configtest.c
_configtest.c:4: warning: function declaration isn’t a prototype
removing: _configtest.c _configtest.o
C compiler: gcc -pthread -fno-strict-aliasing -DNDEBUG -g -fwrapv -O2
-Wall -Wstrict-prototypes -fPIC

compile options: '-Inumpy/core/src/private -Inumpy/core/src
-Inumpy/core -Inumpy/core/src/npymath -Inumpy/core/src/multiarray
-Inumpy/core/src/umath -Inumpy/core/include -I/usr/include/python2.6
-c'
gcc: _configtest.c
_configtest.c:4: warning: function declaration isn’t a prototype
removing: _configtest.c _configtest.o
C compiler: gcc -pthread -fno-strict-aliasing -DNDEBUG -g -fwrapv -O2
-Wall -Wstrict-prototypes -fPIC

compile options: '-Inumpy/core/src/private -Inumpy/core/src
-Inumpy/core -Inumpy/core/src/npymath -Inumpy/core/src/multiarray
-Inumpy/core/src/umath -Inumpy/core/include -I/usr/include/python2.6
-c'
gcc: _configtest.c
_configtest.c:6: warning: function declaration isn’t a prototype
removing: _configtest.c _configtest.o
C compiler: gcc -pthread -fno-strict-aliasing -DNDEBUG -g -fwrapv -O2
-Wall -Wstrict-prototypes -fPIC

compile options: '-Inumpy/core/src/private -Inumpy/core/src
-Inumpy/core -Inumpy/core/src/npymath -Inumpy/core/src/multiarray
-Inumpy/core/src/umath -Inumpy/core/include -I/usr/include/python2.6
-c'
gcc: _configtest.c
_configtest.c:6: warning: function declaration isn’t a prototype
removing: _configtest.c _configtest.o
C compiler: gcc -pthread -fno-strict-aliasing -DNDEBUG -g -fwrapv -O2
-Wall -Wstrict-prototypes -fPIC

compile options: '-Inumpy/core/src/private -Inumpy/core/src
-Inumpy/core -Inumpy/core/src/npymath -Inumpy/core/src/multiarray
-Inumpy/core/src/umath -Inumpy/core/include -I/usr/include/python2.6
-c'
gcc: _configtest.c
_configtest.c:5: warning: function declaration isn’t a prototype
success!
removing: _configtest.c _configtest.o
C compiler: gcc -pthread -fno-strict-aliasing -DNDEBUG -g -fwrapv -O2
-Wall -Wstrict-prototypes -fPIC

compile options: '-Inumpy/core/src/private -Inumpy/core/src
-Inumpy/core -Inumpy/core/src/npymath -Inumpy/core/src/multiarray
-Inumpy/core/src/umath -Inumpy/core/include -I/usr/include/python2.6
-c'
gcc: _configtest.c
_configtest.c:6: warning: function declaration isn’t a prototype
removing: _configtest.c _configtest.o
C compiler: gcc -pthread -fno-strict-aliasing -DNDEBUG -g -fwrapv -O2
-Wall -Wstrict-prototypes -fPIC

compile options: '-Inumpy/core/src/private -Inumpy/core/src
-Inumpy/core -Inumpy/core/src/npymath -Inumpy/core/src/multiarray
-Inumpy/core/src/umath -Inumpy/core/include -I/usr/include/python2.6
-c'
gcc: _configtest.c
_configtest.c:6: warning: function declaration isn’t a prototype
removing: _configtest.c _configtest.o
C compiler: gcc -pthread -fno-strict-aliasing -DNDEBUG -g -fwrapv -O2
-Wall -Wstrict-prototypes -fPIC

compile options: '-Inumpy/core/src/private -Inumpy/core/src
-Inumpy/core -Inumpy/core/src/npymath -Inumpy/core/src/multiarray
-Inumpy/core/src/umath -Inumpy/core/include -I/usr/include/python2.6
-c'
gcc: _configtest.c
_configtest.c:4: warning: function declaration isn’t a prototype
removing: _configtest.c _configtest.o
C compiler: gcc -pthread -fno-strict-aliasing -DNDEBUG -g -fwrapv -O2
-Wall -Wstrict-prototypes -fPIC

compile options: '-Inumpy/core/src/private -Inumpy/core/src
-Inumpy/core -Inumpy/core/src/npymath -Inumpy/core/src/multiarray
-Inumpy/core/src/umath -Inumpy/core/include -I/usr/include/python2.6
-c'
gcc: _configtest.c
_configtest.c:4: warning: function declaration isn’t a prototype
removing: _configtest.c _configtest.o
C compiler: gcc -pthread -fno-strict-aliasing -DNDEBUG -g -fwrapv -O2
-Wall -Wstrict-prototypes -fPIC

compile options: '-Inumpy/core/src/private -Inumpy/core/src
-Inumpy/core -Inumpy/core/src/npymath -Inumpy/core/src/multiarray
-Inumpy/core/src/umath -Inumpy/core/include -I/usr/include/python2.6
-c'
gcc: _configtest.c
_configtest.c:5: warning: function declaration isn’t a prototype
success!
removing: _configtest.c _configtest.o
C compiler: gcc -pthread -fno-strict-aliasing -DNDEBUG -g -fwrapv -O2
-Wall -Wstrict-prototypes -fPIC

compile options: '-Inumpy/core/src/private -Inumpy/core/src
-Inumpy/core -Inumpy/core/src/npymath -Inumpy/core/src/multiarray
-Inumpy/core/src/umath -Inumpy/core/include -I/usr/include/python2.6
-c'
gcc: _configtest.c
_configtest.c:1: warning: conflicting types for built-in function ‘exp’
gcc -pthread _configtest.o -o _configtest
_configtest.o: In function `main':
/home/ryan/Downloads/numpy-1.6.1/_configtest.c:6: undefined reference to `exp'
collect2: ld returned 1 exit status
_configtest.o: In function `main':
/home/ryan/Downloads/numpy-1.6.1/_configtest.c:6: undefined reference to `exp'
collect2: ld returned 1 exit status
failure.
removing: _configtest.c _configtest.o
C compiler: gcc -pthread -fno-strict-aliasing -DNDEBUG -g -fwrapv -O2
-Wall -Wstrict-prototypes -fPIC

compile options: '-Inumpy/core/src/private -Inumpy/core/src
-Inumpy/core -Inumpy/core/src/npymath -Inumpy/core/src/multiarray
-Inumpy/core/src/umath -Inumpy/core/include -I/usr/include/python2.6
-c'
gcc: _configtest.c
_configtest.c:1: warning: conflicting types for built-in function ‘exp’
gcc -pthread _configtest.o -lm -o _configtest
success!
removing: _configtest.c _configtest.o _configtest
C compiler: gcc -pthread -fno-strict-aliasing -DNDEBUG -g -fwrapv -O2
-Wall -Wstrict-prototypes -fPIC

compile options: '-Inumpy/core/src/private -Inumpy/core/src
-Inumpy/core -Inumpy/core/src/npymath -Inumpy/core/src/multiarray
-Inumpy/core/src/umath -Inumpy/core/include -I/usr/include/python2.6
-c'
gcc: _configtest.c
_configtest.c:1: warning: conflicting types for built-in function ‘asin’
_configtest.c:2: warning: conflicting types for built-in function ‘cos’
_configtest.c:3: warning: conflicting types for built-in function ‘log’
_configtest.c:4: warning: conflicting types for built-in function ‘fabs’
_configtest.c:5: warning: conflicting types for built-in function ‘tanh’
_configtest.c:6: warning: conflicting types for built-in function ‘atan’
_configtest.c:7: warning: conflicting types for built-in function ‘acos’
_configtest.c:8: warning: conflicting types for built-in function ‘floor’
_configtest.c:9: warning: conflicting types for built-in function ‘fmod’
_configtest.c:10: warning: conflicting types for built-in function ‘sqrt’
_configtest.c:11: warning: conflicting types for built-in function ‘cosh’
_configtest.c:12: warning: conflicting types for built-in function ‘modf’
_configtest.c:13: warning: conflicting types for built-in function ‘sinh’
_configtest.c:14: warning: conflicting types for built-in function ‘frexp’
_configtest.c:15: warning: conflicting types for built-in function ‘exp’
_configtest.c:16: warning: conflicting types for built-in function ‘tan’
_configtest.c:17: warning: conflicting types for built-in function ‘ceil’
_configtest.c:18: warning: conflicting types for built-in function ‘log10’
_configtest.c:19: warning: conflicting types for built-in function ‘sin’
_configtest.c:20: warning: conflicting types for built-in function ‘ldexp’
gcc -pthread _configtest.o -lm -o _configtest
success!
removing: _configtest.c _configtest.o _configtest
C compiler: gcc -pthread -fno-strict-aliasing -DNDEBUG -g -fwrapv -O2
-Wall -Wstrict-prototypes -fPIC

compile options: '-Inumpy/core/src/private -Inumpy/core/src
-Inumpy/core -Inumpy/core/src/npymath -Inumpy/core/src/multiarray
-Inumpy/core/src/umath -Inumpy/core/include -I/usr/include/python2.6
-c'
gcc: _configtest.c
_configtest.c:6: warning: function declaration isn’t a prototype
success!
removing: _configtest.c _configtest.o
C compiler: gcc -pthread -fno-strict-aliasing -DNDEBUG -g -fwrapv -O2
-Wall -Wstrict-prototypes -fPIC

compile options: '-Inumpy/core/src/private -Inumpy/core/src
-Inumpy/core -Inumpy/core/src/npymath -Inumpy/core/src/multiarray
-Inumpy/core/src/umath -Inumpy/core/include -I/usr/include/python2.6
-c'
gcc: _configtest.c
_configtest.c:6: warning: function declaration isn’t a prototype
success!
removing: _configtest.c _configtest.o
C compiler: gcc -pthread -fno-strict-aliasing -DNDEBUG -g -fwrapv -O2
-Wall -Wstrict-prototypes -fPIC

compile options: '-Inumpy/core/src/private -Inumpy/core/src
-Inumpy/core -Inumpy/core/src/npymath -Inumpy/core/src/multiarray
-Inumpy/core/src/umath -Inumpy/core/include -I/usr/include/python2.6
-c'
gcc: _configtest.c
_configtest.c:6: warning: function declaration isn’t a prototype
success!
removing: _configtest.c _configtest.o
C compiler: gcc -pthread -fno-strict-aliasing -DNDEBUG -g -fwrapv -O2
-Wall -Wstrict-prototypes -fPIC

compile options: '-Inumpy/core/src/private -Inumpy/core/src
-Inumpy/core -Inumpy/core/src/npymath -Inumpy/core/src/multiarray
-Inumpy/core/src/umath -Inumpy/core/include -I/usr/include/python2.6
-c'
gcc: _configtest.c
_configtest.c:6: warning: function declaration isn’t a prototype
success!
removing: _configtest.c _configtest.o
C compiler: gcc -pthread -fno-strict-aliasing -DNDEBUG -g -fwrapv -O2
-Wall -Wstrict-prototypes -fPIC

compile options: '-Inumpy/core/src/private -Inumpy/core/src
-Inumpy/core -Inumpy/core/src/npymath -Inumpy/core/src/multiarray
-Inumpy/core/src/umath -Inumpy/core/include -I/usr/include/python2.6
-c'
gcc: _configtest.c
_configtest.c:6: warning: function declaration isn’t a prototype
success!
removing: _configtest.c _configtest.o
C compiler: gcc -pthread -fno-strict-aliasing -DNDEBUG -g -fwrapv -O2
-Wall -Wstrict-prototypes -fPIC

compile options: '-Inumpy/core/src/private -Inumpy/core/src
-Inumpy/core -Inumpy/core/src/npymath -Inumpy/core/src/multiarray
-Inumpy/core/src/umath -Inumpy/core/include -I/usr/include/python2.6
-c'
gcc: _configtest.c
_configtest.c:6: warning: function declaration isn’t a prototype
success!
removing: _configtest.c _configtest.o
C compiler: gcc -pthread -fno-strict-aliasing -DNDEBUG -g -fwrapv -O2
-Wall -Wstrict-prototypes -fPIC

compile options: '-Inumpy/core/src/private -Inumpy/core/src
-Inumpy/core -Inumpy/core/src/npymath -Inumpy/core/src/multiarray
-Inumpy/core/src/umath -Inumpy/core/include -I/usr/include/python2.6
-c'
gcc: _configtest.c
_configtest.c:6: warning: function declaration isn’t a prototype
success!
removing: _configtest.c _configtest.o
C compiler: gcc -pthread -fno-strict-aliasing -DNDEBUG -g -fwrapv -O2
-Wall -Wstrict-prototypes -fPIC

compile options: '-Inumpy/core/src/private -Inumpy/core/src
-Inumpy/core -Inumpy/core/src/npymath -Inumpy/core/src/multiarray
-Inumpy/core/src/umath -Inumpy/core/include -I/usr/include/python2.6
-c'
gcc: _configtest.c
_configtest.c:1: warning: conflicting types for built-in function ‘log2’
_configtest.c:2: warning: conflicting types for built-in function ‘pow’
_configtest.c:3: warning: conflicting types for built-in function ‘exp2’
_configtest.c:4: warning: conflicting types for built-in function ‘atan2’
_configtest.c:5: warning: conflicting types for built-in function ‘rint’
_configtest.c:6: warning: conflicting types for built-in function ‘nextafter’
_configtest.c:7: warning: conflicting types for built-in function ‘trunc’
gcc -pthread _configtest.o -lm -o _configtest
success!
removing: _configtest.c _configtest.o _configtest
C compiler: gcc -pthread -fno-strict-aliasing -DNDEBUG -g -fwrapv -O2
-Wall -Wstrict-prototypes -fPIC

compile options: '-Inumpy/core/src/private -Inumpy/core/src
-Inumpy/core -Inumpy/core/src/npymath -Inumpy/core/src/multiarray
-Inumpy/core/src/umath -Inumpy/core/include -I/usr/include/python2.6
-c'
gcc: _configtest.c
_configtest.c:1: warning: conflicting types for built-in function ‘cosf’
_configtest.c:2: warning: conflicting types for built-in function ‘coshf’
_configtest.c:3: warning: conflicting types for built-in function ‘rintf’
_configtest.c:4: warning: conflicting types for built-in function ‘fabsf’
_configtest.c:5: warning: conflicting types for built-in function ‘floorf’
_configtest.c:6: warning: conflicting types for built-in function ‘nextafterf’
_configtest.c:7: warning: conflicting types for built-in function ‘tanhf’
_configtest.c:8: warning: conflicting types for built-in function ‘log10f’
_configtest.c:9: warning: conflicting types for built-in function ‘logf’
_configtest.c:10: warning: conflicting types for built-in function ‘sinhf’
_configtest.c:11: warning: conflicting types for built-in function ‘acosf’
_configtest.c:12: warning: conflicting types for built-in function ‘sqrtf’
_configtest.c:13: warning: conflicting types for built-in function ‘ldexpf’
_configtest.c:14: warning: conflicting types for built-in function ‘hypotf’
_configtest.c:15: warning: conflicting types for built-in function ‘log2f’
_configtest.c:16: warning: conflicting types for built-in function ‘exp2f’
_configtest.c:17: warning: conflicting types for built-in function ‘atanf’
_configtest.c:18: warning: conflicting types for built-in function ‘fmodf’
_configtest.c:19: warning: conflicting types for built-in function ‘atan2f’
_configtest.c:20: warning: conflicting types for built-in function ‘modff’
_configtest.c:21: warning: conflicting types for built-in function ‘ceilf’
_configtest.c:22: warning: conflicting types for built-in function ‘log1pf’
_configtest.c:23: warning: conflicting types for built-in function ‘asinf’
_configtest.c:24: warning: conflicting types for built-in function ‘copysignf’
_configtest.c:25: warning: conflicting types for built-in function ‘acoshf’
_configtest.c:26: warning: conflicting types for built-in function ‘sinf’
_configtest.c:27: warning: conflicting types for built-in function ‘tanf’
_configtest.c:28: warning: conflicting types for built-in function ‘atanhf’
_configtest.c:29: warning: conflicting types for built-in function ‘truncf’
_configtest.c:30: warning: conflicting types for built-in function ‘asinhf’
_configtest.c:31: warning: conflicting types for built-in function ‘frexpf’
_configtest.c:32: warning: conflicting types for built-in function ‘powf’
_configtest.c:33: warning: conflicting types for built-in function ‘expf’
_configtest.c:34: warning: conflicting types for built-in function ‘expm1f’
gcc -pthread _configtest.o -lm -o _configtest
success!
removing: _configtest.c _configtest.o _configtest
C compiler: gcc -pthread -fno-strict-aliasing -DNDEBUG -g -fwrapv -O2
-Wall -Wstrict-prototypes -fPIC

compile options: '-Inumpy/core/src/private -Inumpy/core/src
-Inumpy/core -Inumpy/core/src/npymath -Inumpy/core/src/multiarray
-Inumpy/core/src/umath -Inumpy/core/include -I/usr/include/python2.6
-c'
gcc: _configtest.c
_configtest.c:1: warning: conflicting types for built-in function ‘tanhl’
_configtest.c:2: warning: conflicting types for built-in function ‘log10l’
_configtest.c:3: warning: conflicting types for built-in function ‘nextafterl’
_configtest.c:4: warning: conflicting types for built-in function ‘coshl’
_configtest.c:5: warning: conflicting types for built-in function ‘cosl’
_configtest.c:6: warning: conflicting types for built-in function ‘floorl’
_configtest.c:7: warning: conflicting types for built-in function ‘rintl’
_configtest.c:8: warning: conflicting types for built-in function ‘fabsl’
_configtest.c:9: warning: conflicting types for built-in function ‘acosl’
_configtest.c:10: warning: conflicting types for built-in function ‘ldexpl’
_configtest.c:11: warning: conflicting types for built-in function ‘sqrtl’
_configtest.c:12: warning: conflicting types for built-in function ‘logl’
_configtest.c:13: warning: conflicting types for built-in function ‘expm1l’
_configtest.c:14: warning: conflicting types for built-in function ‘hypotl’
_configtest.c:15: warning: conflicting types for built-in function ‘log2l’
_configtest.c:16: warning: conflicting types for built-in function ‘copysignl’
_configtest.c:17: warning: conflicting types for built-in function ‘exp2l’
_configtest.c:18: warning: conflicting types for built-in function ‘atanl’
_configtest.c:19: warning: conflicting types for built-in function ‘frexpl’
_configtest.c:20: warning: conflicting types for built-in function ‘atan2l’
_configtest.c:21: warning: conflicting types for built-in function ‘sinhl’
_configtest.c:22: warning: conflicting types for built-in function ‘fmodl’
_configtest.c:23: warning: conflicting types for built-in function ‘log1pl’
_configtest.c:24: warning: conflicting types for built-in function ‘asinl’
_configtest.c:25: warning: conflicting types for built-in function ‘ceill’
_configtest.c:26: warning: conflicting types for built-in function ‘sinl’
_configtest.c:27: warning: conflicting types for built-in function ‘acoshl’
_configtest.c:28: warning: conflicting types for built-in function ‘atanhl’
_configtest.c:29: warning: conflicting types for built-in function ‘tanl’
_configtest.c:30: warning: conflicting types for built-in function ‘truncl’
_configtest.c:31: warning: conflicting types for built-in function ‘powl’
_configtest.c:32: warning: conflicting types for built-in function ‘expl’
_configtest.c:33: warning: conflicting types for built-in function ‘modfl’
_configtest.c:34: warning: conflicting types for built-in function ‘asinhl’
gcc -pthread _configtest.o -lm -o _configtest
success!
removing: _configtest.c _configtest.o _configtest
C compiler: gcc -pthread -fno-strict-aliasing -DNDEBUG -g -fwrapv -O2
-Wall -Wstrict-prototypes -fPIC

compile options: '-Inumpy/core/src/private -Inumpy/core/src
-Inumpy/core -Inumpy/core/src/npymath -Inumpy/core/src/multiarray
-Inumpy/core/src/umath -Inumpy/core/include -I/usr/include/python2.6
-c'
gcc: _configtest.c
_configtest.c:6: warning: function declaration isn’t a prototype
success!
removing: _configtest.c _configtest.o
C compiler: gcc -pthread -fno-strict-aliasing -DNDEBUG -g -fwrapv -O2
-Wall -Wstrict-prototypes -fPIC

compile options: '-Inumpy/core/src/private -Inumpy/core/src
-Inumpy/core -Inumpy/core/src/npymath -Inumpy/core/src/multiarray
-Inumpy/core/src/umath -Inumpy/core/include -I/usr/include/python2.6
-c'
gcc: _configtest.c
_configtest.c:6: warning: function declaration isn’t a prototype
success!
removing: _configtest.c _configtest.o
C compiler: gcc -pthread -fno-strict-aliasing -DNDEBUG -g -fwrapv -O2
-Wall -Wstrict-prototypes -fPIC

compile options: '-Inumpy/core/src/private -Inumpy/core/src
-Inumpy/core -Inumpy/core/src/npymath -Inumpy/core/src/multiarray
-Inumpy/core/src/umath -Inumpy/core/include -I/usr/include/python2.6
-c'
gcc: _configtest.c
_configtest.c:6: warning: function declaration isn’t a prototype
success!
removing: _configtest.c _configtest.o
C compiler: gcc -pthread -fno-strict-aliasing -DNDEBUG -g -fwrapv -O2
-Wall -Wstrict-prototypes -fPIC

compile options: '-Inumpy/core/src/private -Inumpy/core/src
-Inumpy/core -Inumpy/core/src/npymath -Inumpy/core/src/multiarray
-Inumpy/core/src/umath -Inumpy/core/include -I/usr/include/python2.6
-c'
gcc: _configtest.c
_configtest.c:6: warning: function declaration isn’t a prototype
success!
removing: _configtest.c _configtest.o
C compiler: gcc -pthread -fno-strict-aliasing -DNDEBUG -g -fwrapv -O2
-Wall -Wstrict-prototypes -fPIC

compile options: '-Inumpy/core/src/private -Inumpy/core/src
-Inumpy/core -Inumpy/core/src/npymath -Inumpy/core/src/multiarray
-Inumpy/core/src/umath -Inumpy/core/include -I/usr/include/python2.6
-c'
gcc: _configtest.c
_configtest.c:6: warning: function declaration isn’t a prototype
_configtest.c: In function ‘main’:
_configtest.c:8: error: ‘HAVE_DECL_SIGNBIT’ undeclared (first use in
this function)
_configtest.c:8: error: (Each undeclared identifier is reported only once
_configtest.c:8: error: for each function it appears in.)
_configtest.c:6: warning: function declaration isn’t a prototype
_configtest.c: In function ‘main’:
_configtest.c:8: error: ‘HAVE_DECL_SIGNBIT’ undeclared (first use in
this function)
_configtest.c:8: error: (Each undeclared identifier is reported only once
_configtest.c:8: error: for each function it appears in.)
failure.
removing: _configtest.c _configtest.o
C compiler: gcc -pthread -fno-strict-aliasing -DNDEBUG -g -fwrapv -O2
-Wall -Wstrict-prototypes -fPIC

compile options: '-Inumpy/core/src/private -Inumpy/core/src
-Inumpy/core -Inumpy/core/src/npymath -Inumpy/core/src/multiarray
-Inumpy/core/src/umath -Inumpy/core/include -I/usr/include/python2.6
-c'
gcc: _configtest.c
_configtest.c:6: warning: function declaration isn’t a prototype
success!
removing: _configtest.c _configtest.o
C compiler: gcc -pthread -fno-strict-aliasing -DNDEBUG -g -fwrapv -O2
-Wall -Wstrict-prototypes -fPIC

compile options: '-Inumpy/core/src/private -Inumpy/core/src
-Inumpy/core -Inumpy/core/src/npymath -Inumpy/core/src/multiarray
-Inumpy/core/src/umath -Inumpy/core/include -I/usr/include/python2.6
-c'
gcc: _configtest.c
_configtest.c:6: warning: function declaration isn’t a prototype
success!
removing: _configtest.c _configtest.o
C compiler: gcc -pthread -fno-strict-aliasing -DNDEBUG -g -fwrapv -O2
-Wall -Wstrict-prototypes -fPIC

compile options: '-Inumpy/core/src/private -Inumpy/core/src
-Inumpy/core -Inumpy/core/src/npymath -Inumpy/core/src/multiarray
-Inumpy/core/src/umath -Inumpy/core/include -I/usr/include/python2.6
-c'
gcc: _configtest.c
_configtest.c:6: warning: function declaration isn’t a prototype
success!
removing: _configtest.c _configtest.o
C compiler: gcc -pthread -fno-strict-aliasing -DNDEBUG -g -fwrapv -O2
-Wall -Wstrict-prototypes -fPIC

compile options: '-Inumpy/core/src/private -Inumpy/core/src
-Inumpy/core -Inumpy/core/src/npymath -Inumpy/core/src/multiarray
-Inumpy/core/src/umath -Inumpy/core/include -I/usr/include/python2.6
-c'
gcc: _configtest.c
success!
removing: _configtest.c _configtest.o
C compiler: gcc -pthread -fno-strict-aliasing -DNDEBUG -g -fwrapv -O2
-Wall -Wstrict-prototypes -fPIC

compile options: '-Inumpy/core/src/private -Inumpy/core/src
-Inumpy/core -Inumpy/core/src/npymath -Inumpy/core/src/multiarray
-Inumpy/core/src/umath -Inumpy/core/include -I/usr/include/python2.6
-c'
gcc: _configtest.c
_configtest.c:4: warning: function declaration isn’t a prototype
removing: _configtest.c _configtest.o
C compiler: gcc -pthread -fno-strict-aliasing -DNDEBUG -g -fwrapv -O2
-Wall -Wstrict-prototypes -fPIC

compile options: '-Inumpy/core/src/private -Inumpy/core/src
-Inumpy/core -Inumpy/core/src/npymath -Inumpy/core/src/multiarray
-Inumpy/core/src/umath -Inumpy/core/include -I/usr/include/python2.6
-c'
gcc: _configtest.c
_configtest.c:4: warning: function declaration isn’t a prototype
removing: _configtest.c _configtest.o
C compiler: gcc -pthread -fno-strict-aliasing -DNDEBUG -g -fwrapv -O2
-Wall -Wstrict-prototypes -fPIC

compile options: '-Inumpy/core/src/private -Inumpy/core/src
-Inumpy/core -Inumpy/core/src/npymath -Inumpy/core/src/multiarray
-Inumpy/core/src/umath -Inumpy/core/include -I/usr/include/python2.6
-c'
gcc: _configtest.c
_configtest.c:4: warning: function declaration isn’t a prototype
removing: _configtest.c _configtest.o
C compiler: gcc -pthread -fno-strict-aliasing -DNDEBUG -g -fwrapv -O2
-Wall -Wstrict-prototypes -fPIC

compile options: '-Inumpy/core/src/private -Inumpy/core/src
-Inumpy/core -Inumpy/core/src/npymath -Inumpy/core/src/multiarray
-Inumpy/core/src/umath -Inumpy/core/include -I/usr/include/python2.6
-c'
gcc: _configtest.c
_configtest.c:1: warning: conflicting types for built-in function ‘cexp’
_configtest.c:2: warning: conflicting types for built-in function ‘clog’
_configtest.c:3: warning: conflicting types for built-in function ‘ccos’
_configtest.c:4: warning: conflicting types for built-in function ‘cimag’
_configtest.c:5: warning: conflicting types for built-in function ‘cabs’
_configtest.c:6: warning: conflicting types for built-in function ‘cpow’
_configtest.c:7: warning: conflicting types for built-in function ‘csqrt’
_configtest.c:8: warning: conflicting types for built-in function ‘carg’
_configtest.c:9: warning: conflicting types for built-in function ‘creal’
_configtest.c:10: warning: conflicting types for built-in function ‘csin’
gcc -pthread _configtest.o -lm -o _configtest
success!
removing: _configtest.c _configtest.o _configtest
C compiler: gcc -pthread -fno-strict-aliasing -DNDEBUG -g -fwrapv -O2
-Wall -Wstrict-prototypes -fPIC

compile options: '-Inumpy/core/src/private -Inumpy/core/src
-Inumpy/core -Inumpy/core/src/npymath -Inumpy/core/src/multiarray
-Inumpy/core/src/umath -Inumpy/core/include -I/usr/include/python2.6
-c'
gcc: _configtest.c
_configtest.c:1: warning: conflicting types for built-in function ‘ccosf’
_configtest.c:2: warning: conflicting types for built-in function ‘cargf’
_configtest.c:3: warning: conflicting types for built-in function ‘csqrtf’
_configtest.c:4: warning: conflicting types for built-in function ‘cpowf’
_configtest.c:5: warning: conflicting types for built-in function ‘cexpf’
_configtest.c:6: warning: conflicting types for built-in function ‘crealf’
_configtest.c:7: warning: conflicting types for built-in function ‘csinf’
_configtest.c:8: warning: conflicting types for built-in function ‘cabsf’
_configtest.c:9: warning: conflicting types for built-in function ‘clogf’
_configtest.c:10: warning: conflicting types for built-in function ‘cimagf’
gcc -pthread _configtest.o -lm -o _configtest
success!
removing: _configtest.c _configtest.o _configtest
C compiler: gcc -pthread -fno-strict-aliasing -DNDEBUG -g -fwrapv -O2
-Wall -Wstrict-prototypes -fPIC

compile options: '-Inumpy/core/src/private -Inumpy/core/src
-Inumpy/core -Inumpy/core/src/npymath -Inumpy/core/src/multiarray
-Inumpy/core/src/umath -Inumpy/core/include -I/usr/include/python2.6
-c'
gcc: _configtest.c
_configtest.c:1: warning: conflicting types for built-in function ‘csqrtl’
_configtest.c:2: warning: conflicting types for built-in function ‘cargl’
_configtest.c:3: warning: conflicting types for built-in function ‘cexpl’
_configtest.c:4: warning: conflicting types for built-in function ‘ccosl’
_configtest.c:5: warning: conflicting types for built-in function ‘cpowl’
_configtest.c:6: warning: conflicting types for built-in function ‘cimagl’
_configtest.c:7: warning: conflicting types for built-in function ‘csinl’
_configtest.c:8: warning: conflicting types for built-in function ‘creall’
_configtest.c:9: warning: conflicting types for built-in function ‘clogl’
_configtest.c:10: warning: conflicting types for built-in function ‘cabsl’
gcc -pthread _configtest.o -lm -o _configtest
success!
removing: _configtest.c _configtest.o _configtest
C compiler: gcc -pthread -fno-strict-aliasing -DNDEBUG -g -fwrapv -O2
-Wall -Wstrict-prototypes -fPIC

compile options: '-Inumpy/core/src/private -Inumpy/core/src
-Inumpy/core -Inumpy/core/src/npymath -Inumpy/core/src/multiarray
-Inumpy/core/src/umath -Inumpy/core/include -I/usr/include/python2.6
-c'
gcc: _configtest.c
success!
removing: _configtest.c _configtest.o
C compiler: gcc -pthread -fno-strict-aliasing -DNDEBUG -g -fwrapv -O2
-Wall -Wstrict-prototypes -fPIC

compile options: '-Inumpy/core/src/private -Inumpy/core/src
-Inumpy/core -Inumpy/core/src/npymath -Inumpy/core/src/multiarray
-Inumpy/core/src/umath -Inumpy/core/include -I/usr/include/python2.6
-c'
gcc: _configtest.c
_configtest.c:5: warning: function declaration isn’t a prototype
success!
removing: _configtest.c _configtest.o
C compiler: gcc -pthread -fno-strict-aliasing -DNDEBUG -g -fwrapv -O2
-Wall -Wstrict-prototypes -fPIC

compile options: '-Inumpy/core/src/private -Inumpy/core/src
-Inumpy/core -Inumpy/core/src/npymath -Inumpy/core/src/multiarray
-Inumpy/core/src/umath -Inumpy/core/include -I/usr/include/python2.6
-c'
gcc: _configtest.c
removing: _configtest.c _configtest.o
('File:', 'build/src.linux-i686-2.6/numpy/core/include/numpy/config.h')
#define HAVE_ENDIAN_H 1
#define SIZEOF_PY_INTPTR_T 4
#define SIZEOF_PY_LONG_LONG 8
#define MATHLIB m
#define HAVE_SIN
#define HAVE_COS
#define HAVE_TAN
#define HAVE_SINH
#define HAVE_COSH
#define HAVE_TANH
#define HAVE_FABS
#define HAVE_FLOOR
#define HAVE_CEIL
#define HAVE_SQRT
#define HAVE_LOG10
#define HAVE_LOG
#define HAVE_EXP
#define HAVE_ASIN
#define HAVE_ACOS
#define HAVE_ATAN
#define HAVE_FMOD
#define HAVE_MODF
#define HAVE_FREXP
#define HAVE_LDEXP
#define HAVE_RINT
#define HAVE_TRUNC
#define HAVE_EXP2
#define HAVE_LOG2
#define HAVE_ATAN2
#define HAVE_POW
#define HAVE_NEXTAFTER
#define HAVE_SINF
#define HAVE_COSF
#define HAVE_TANF
#define HAVE_SINHF
#define HAVE_COSHF
#define HAVE_TANHF
#define HAVE_FABSF
#define HAVE_FLOORF
#define HAVE_CEILF
#define HAVE_RINTF
#define HAVE_TRUNCF
#define HAVE_SQRTF
#define HAVE_LOG10F
#define HAVE_LOGF
#define HAVE_LOG1PF
#define HAVE_EXPF
#define HAVE_EXPM1F
#define HAVE_ASINF
#define HAVE_ACOSF
#define HAVE_ATANF
#define HAVE_ASINHF
#define HAVE_ACOSHF
#define HAVE_ATANHF
#define HAVE_HYPOTF
#define HAVE_ATAN2F
#define HAVE_POWF
#define HAVE_FMODF
#define HAVE_MODFF
#define HAVE_FREXPF
#define HAVE_LDEXPF
#define HAVE_EXP2F
#define HAVE_LOG2F
#define HAVE_COPYSIGNF
#define HAVE_NEXTAFTERF
#define HAVE_SINL
#define HAVE_COSL
#define HAVE_TANL
#define HAVE_SINHL
#define HAVE_COSHL
#define HAVE_TANHL
#define HAVE_FABSL
#define HAVE_FLOORL
#define HAVE_CEILL
#define HAVE_RINTL
#define HAVE_TRUNCL
#define HAVE_SQRTL
#define HAVE_LOG10L
#define HAVE_LOGL
#define HAVE_LOG1PL
#define HAVE_EXPL
#define HAVE_EXPM1L
#define HAVE_ASINL
#define HAVE_ACOSL
#define HAVE_ATANL
#define HAVE_ASINHL
#define HAVE_ACOSHL
#define HAVE_ATANHL
#define HAVE_HYPOTL
#define HAVE_ATAN2L
#define HAVE_POWL
#define HAVE_FMODL
#define HAVE_MODFL
#define HAVE_FREXPL
#define HAVE_LDEXPL
#define HAVE_EXP2L
#define HAVE_LOG2L
#define HAVE_COPYSIGNL
#define HAVE_NEXTAFTERL
#define HAVE_DECL_SIGNBIT
#define HAVE_COMPLEX_H
#define HAVE_CREAL
#define HAVE_CIMAG
#define HAVE_CABS
#define HAVE_CARG
#define HAVE_CEXP
#define HAVE_CSQRT
#define HAVE_CLOG
#define HAVE_CCOS
#define HAVE_CSIN
#define HAVE_CPOW
#define HAVE_CREALF
#define HAVE_CIMAGF
#define HAVE_CABSF
#define HAVE_CARGF
#define HAVE_CEXPF
#define HAVE_CSQRTF
#define HAVE_CLOGF
#define HAVE_CCOSF
#define HAVE_CSINF
#define HAVE_CPOWF
#define HAVE_CREALL
#define HAVE_CIMAGL
#define HAVE_CABSL
#define HAVE_CARGL
#define HAVE_CEXPL
#define HAVE_CSQRTL
#define HAVE_CLOGL
#define HAVE_CCOSL
#define HAVE_CSINL
#define HAVE_CPOWL
#define HAVE_LDOUBLE_INTEL_EXTENDED_12_BYTES_LE 1
#ifndef __cplusplus
/* #undef inline */
#endif

#ifndef _NPY_NPY_CONFIG_H_
#error config.h should never be included directly, include npy_config.h instead
#endif

EOF
  adding 'build/src.linux-i686-2.6/numpy/core/include/numpy/config.h'
to sources.
Generating build/src.linux-i686-2.6/numpy/core/include/numpy/_numpyconfig.h
C compiler: gcc -pthread -fno-strict-aliasing -DNDEBUG -g -fwrapv -O2
-Wall -Wstrict-prototypes -fPIC

compile options: '-Inumpy/core/src/private -Inumpy/core/src
-Inumpy/core -Inumpy/core/src/npymath -Inumpy/core/src/multiarray
-Inumpy/core/src/umath -Inumpy/core/include -I/usr/include/python2.6
-c'
gcc: _configtest.c
_configtest.c:1: warning: conflicting types for built-in function ‘exp’
gcc -pthread _configtest.o -o _configtest
_configtest.o: In function `main':
/home/ryan/Downloads/numpy-1.6.1/_configtest.c:6: undefined reference to `exp'
collect2: ld returned 1 exit status
_configtest.o: In function `main':
/home/ryan/Downloads/numpy-1.6.1/_configtest.c:6: undefined reference to `exp'
collect2: ld returned 1 exit status
failure.
removing: _configtest.c _configtest.o
C compiler: gcc -pthread -fno-strict-aliasing -DNDEBUG -g -fwrapv -O2
-Wall -Wstrict-prototypes -fPIC

compile options: '-Inumpy/core/src/private -Inumpy/core/src
-Inumpy/core -Inumpy/core/src/npymath -Inumpy/core/src/multiarray
-Inumpy/core/src/umath -Inumpy/core/include -I/usr/include/python2.6
-c'
gcc: _configtest.c
_configtest.c:1: warning: conflicting types for built-in function ‘exp’
gcc -pthread _configtest.o -lm -o _configtest
success!
removing: _configtest.c _configtest.o _configtest
C compiler: gcc -pthread -fno-strict-aliasing -DNDEBUG -g -fwrapv -O2
-Wall -Wstrict-prototypes -fPIC

compile options: '-Inumpy/core/src/private -Inumpy/core/src
-Inumpy/core -Inumpy/core/src/npymath -Inumpy/core/src/multiarray
-Inumpy/core/src/umath -Inumpy/core/include -I/usr/include/python2.6
-c'
gcc: _configtest.c
_configtest.c:5: warning: function declaration isn’t a prototype
success!
removing: _configtest.c _configtest.o
C compiler: gcc -pthread -fno-strict-aliasing -DNDEBUG -g -fwrapv -O2
-Wall -Wstrict-prototypes -fPIC

compile options: '-Inumpy/core/src/private -Inumpy/core/src
-Inumpy/core -Inumpy/core/src/npymath -Inumpy/core/src/multiarray
-Inumpy/core/src/umath -Inumpy/core/include -I/usr/include/python2.6
-c'
gcc: _configtest.c
_configtest.c:4: warning: function declaration isn’t a prototype
_configtest.c:5:18: warning: extra tokens at end of #ifndef directive
_configtest.c: In function ‘main’:
_configtest.c:8: warning: control reaches end of non-void function
success!
removing: _configtest.c _configtest.o
File: build/src.linux-i686-2.6/numpy/core/include/numpy/_numpyconfig.h
#define NPY_HAVE_ENDIAN_H 1
#define NPY_SIZEOF_SHORT SIZEOF_SHORT
#define NPY_SIZEOF_INT SIZEOF_INT
#define NPY_SIZEOF_LONG SIZEOF_LONG
#define NPY_SIZEOF_FLOAT 4
#define NPY_SIZEOF_COMPLEX_FLOAT 8
#define NPY_SIZEOF_DOUBLE 8
#define NPY_SIZEOF_COMPLEX_DOUBLE 16
#define NPY_SIZEOF_LONGDOUBLE 12
#define NPY_SIZEOF_COMPLEX_LONGDOUBLE 24
#define NPY_SIZEOF_PY_INTPTR_T 4
#define NPY_SIZEOF_PY_LONG_LONG 8
#define NPY_SIZEOF_LONGLONG 8
#define NPY_NO_SMP 0
#define NPY_HAVE_DECL_ISNAN
#define NPY_HAVE_DECL_ISINF
#define NPY_HAVE_DECL_ISFINITE
#define NPY_HAVE_DECL_SIGNBIT
#define NPY_USE_C99_COMPLEX
#define NPY_HAVE_COMPLEX_DOUBLE 1
#define NPY_HAVE_COMPLEX_FLOAT 1
#define NPY_HAVE_COMPLEX_LONG_DOUBLE 1
#define NPY_USE_C99_FORMATS 1
#define NPY_VISIBILITY_HIDDEN __attribute__((visibility("hidden")))
#define NPY_ABI_VERSION 0x01000009
#define NPY_API_VERSION 0x00000006

#ifndef __STDC_FORMAT_MACROS
#define __STDC_FORMAT_MACROS 1
#endif

EOF
  adding 'build/src.linux-i686-2.6/numpy/core/include/numpy/_numpyconfig.h'
to sources.
executing numpy/core/code_generators/generate_numpy_api.py
  adding 'build/src.linux-i686-2.6/numpy/core/include/numpy/__multiarray_api.h'
to sources.
conv_template:> build/src.linux-i686-2.6/numpy/core/src/_sortmodule.c
numpy.core - nothing done with h_files =
['build/src.linux-i686-2.6/numpy/core/include/numpy/config.h',
'build/src.linux-i686-2.6/numpy/core/include/numpy/_numpyconfig.h',
'build/src.linux-i686-2.6/numpy/core/include/numpy/__multiarray_api.h']
building extension "numpy.core.multiarray" sources
non-existing path in 'numpy/core':
'build/src.linux-i686-2.6/numpy/core/src/multiarray'
creating build/src.linux-i686-2.6/numpy/core/src/multiarray
conv_template:> build/src.linux-i686-2.6/numpy/core/src/multiarray/scalartypes.c
conv_template:> build/src.linux-i686-2.6/numpy/core/src/multiarray/arraytypes.c
conv_template:> build/src.linux-i686-2.6/numpy/core/src/multiarray/nditer.c
conv_template:>
build/src.linux-i686-2.6/numpy/core/src/multiarray/lowlevel_strided_loops.c
conv_template:> build/src.linux-i686-2.6/numpy/core/src/multiarray/einsum.c
  adding 'build/src.linux-i686-2.6/numpy/core/include/numpy/config.h'
to sources.
  adding 'build/src.linux-i686-2.6/numpy/core/include/numpy/_numpyconfig.h'
to sources.
executing numpy/core/code_generators/generate_numpy_api.py
  adding 'build/src.linux-i686-2.6/numpy/core/include/numpy/__multiarray_api.h'
to sources.
numpy.core - nothing done with h_files =
['build/src.linux-i686-2.6/numpy/core/include/numpy/config.h',
'build/src.linux-i686-2.6/numpy/core/include/numpy/_numpyconfig.h',
'build/src.linux-i686-2.6/numpy/core/include/numpy/__multiarray_api.h']
building extension "numpy.core.umath" sources
  adding 'build/src.linux-i686-2.6/numpy/core/include/numpy/config.h'
to sources.
  adding 'build/src.linux-i686-2.6/numpy/core/include/numpy/_numpyconfig.h'
to sources.
executing numpy/core/code_generators/generate_ufunc_api.py
  adding 'build/src.linux-i686-2.6/numpy/core/include/numpy/__ufunc_api.h'
to sources.
non-existing path in 'numpy/core':
'build/src.linux-i686-2.6/numpy/core/src/umath'
creating build/src.linux-i686-2.6/numpy/core/src/umath
conv_template:> build/src.linux-i686-2.6/numpy/core/src/umath/loops.c
conv_template:> build/src.linux-i686-2.6/numpy/core/src/umath/umathmodule.c
conv_template:> build/src.linux-i686-2.6/numpy/core/src/umath/funcs.inc
  adding 'build/src.linux-i686-2.6/numpy/core/src/umath' to include_dirs.
numpy.core - nothing done with h_files =
['build/src.linux-i686-2.6/numpy/core/src/umath/funcs.inc',
'build/src.linux-i686-2.6/numpy/core/include/numpy/config.h',
'build/src.linux-i686-2.6/numpy/core/include/numpy/_numpyconfig.h',
'build/src.linux-i686-2.6/numpy/core/include/numpy/__ufunc_api.h']
building extension "numpy.core.scalarmath" sources
  adding 'build/src.linux-i686-2.6/numpy/core/include/numpy/config.h'
to sources.
  adding 'build/src.linux-i686-2.6/numpy/core/include/numpy/_numpyconfig.h'
to sources.
executing numpy/core/code_generators/generate_numpy_api.py
  adding 'build/src.linux-i686-2.6/numpy/core/include/numpy/__multiarray_api.h'
to sources.
executing numpy/core/code_generators/generate_ufunc_api.py
  adding 'build/src.linux-i686-2.6/numpy/core/include/numpy/__ufunc_api.h'
to sources.
conv_template:> build/src.linux-i686-2.6/numpy/core/src/scalarmathmodule.c
numpy.core - nothing done with h_files =
['build/src.linux-i686-2.6/numpy/core/include/numpy/config.h',
'build/src.linux-i686-2.6/numpy/core/include/numpy/_numpyconfig.h',
'build/src.linux-i686-2.6/numpy/core/include/numpy/__multiarray_api.h',
'build/src.linux-i686-2.6/numpy/core/include/numpy/__ufunc_api.h']
building extension "numpy.core._dotblas" sources
  adding 'numpy/core/blasdot/_dotblas.c' to sources.
building extension "numpy.core.umath_tests" sources
conv_template:> build/src.linux-i686-2.6/numpy/core/src/umath/umath_tests.c
building extension "numpy.core.multiarray_tests" sources
conv_template:>
build/src.linux-i686-2.6/numpy/core/src/multiarray/multiarray_tests.c
building extension "numpy.lib._compiled_base" sources
building extension "numpy.numarray._capi" sources
building extension "numpy.fft.fftpack_lite" sources
building extension "numpy.linalg.lapack_lite" sources
creating build/src.linux-i686-2.6/numpy/linalg
  adding 'numpy/linalg/lapack_litemodule.c' to sources.
  adding 'numpy/linalg/python_xerbla.c' to sources.
building extension "numpy.random.mtrand" sources
creating build/src.linux-i686-2.6/numpy/random
/home/ryan/Downloads/numpy-1.6.1/numpy/distutils/command/config.py:40:
DeprecationWarning:
+++++++++++++++++++++++++++++++++++++++++++++++++
Usage of try_run is deprecated: please do not
use it anymore, and avoid configuration checks
involving running executable on the target machine.
+++++++++++++++++++++++++++++++++++++++++++++++++

  DeprecationWarning)
C compiler: gcc -pthread -fno-strict-aliasing -DNDEBUG -g -fwrapv -O2
-Wall -Wstrict-prototypes -fPIC

compile options: '-Inumpy/core/src/private -Inumpy/core/src
-Inumpy/core -Inumpy/core/src/npymath -Inumpy/core/src/multiarray
-Inumpy/core/src/umath -Inumpy/core/include -I/usr/include/python2.6
-c'
gcc: _configtest.c
gcc -pthread _configtest.o -o _configtest
_configtest
failure.
removing: _configtest.c _configtest.o _configtest
building data_files sources
build_src: building npy-pkg config files
running build_py
creating build/lib.linux-i686-2.6
creating build/lib.linux-i686-2.6/numpy
copying numpy/version.py -> build/lib.linux-i686-2.6/numpy
copying numpy/__init__.py -> build/lib.linux-i686-2.6/numpy
copying numpy/setupscons.py -> build/lib.linux-i686-2.6/numpy
copying numpy/setup.py -> build/lib.linux-i686-2.6/numpy
copying numpy/ctypeslib.py -> build/lib.linux-i686-2.6/numpy
copying numpy/dual.py -> build/lib.linux-i686-2.6/numpy
copying numpy/matlib.py -> build/lib.linux-i686-2.6/numpy
copying numpy/_import_tools.py -> build/lib.linux-i686-2.6/numpy
copying numpy/add_newdocs.py -> build/lib.linux-i686-2.6/numpy
copying build/src.linux-i686-2.6/numpy/__config__.py ->
build/lib.linux-i686-2.6/numpy
creating build/lib.linux-i686-2.6/numpy/distutils
copying numpy/distutils/cpuinfo.py -> build/lib.linux-i686-2.6/numpy/distutils
copying numpy/distutils/__init__.py -> build/lib.linux-i686-2.6/numpy/distutils
copying numpy/distutils/unixccompiler.py ->
build/lib.linux-i686-2.6/numpy/distutils
copying numpy/distutils/__version__.py ->
build/lib.linux-i686-2.6/numpy/distutils
copying numpy/distutils/setupscons.py ->
build/lib.linux-i686-2.6/numpy/distutils
copying numpy/distutils/exec_command.py ->
build/lib.linux-i686-2.6/numpy/distutils
copying numpy/distutils/setup.py -> build/lib.linux-i686-2.6/numpy/distutils
copying numpy/distutils/line_endings.py ->
build/lib.linux-i686-2.6/numpy/distutils
copying numpy/distutils/info.py -> build/lib.linux-i686-2.6/numpy/distutils
copying numpy/distutils/numpy_distribution.py ->
build/lib.linux-i686-2.6/numpy/distutils
copying numpy/distutils/environment.py ->
build/lib.linux-i686-2.6/numpy/distutils
copying numpy/distutils/misc_util.py -> build/lib.linux-i686-2.6/numpy/distutils
copying numpy/distutils/extension.py -> build/lib.linux-i686-2.6/numpy/distutils
copying numpy/distutils/ccompiler.py -> build/lib.linux-i686-2.6/numpy/distutils
copying numpy/distutils/intelccompiler.py ->
build/lib.linux-i686-2.6/numpy/distutils
copying numpy/distutils/interactive.py ->
build/lib.linux-i686-2.6/numpy/distutils
copying numpy/distutils/mingw32ccompiler.py ->
build/lib.linux-i686-2.6/numpy/distutils
copying numpy/distutils/system_info.py ->
build/lib.linux-i686-2.6/numpy/distutils
copying numpy/distutils/npy_pkg_config.py ->
build/lib.linux-i686-2.6/numpy/distutils
copying numpy/distutils/conv_template.py ->
build/lib.linux-i686-2.6/numpy/distutils
copying numpy/distutils/lib2def.py -> build/lib.linux-i686-2.6/numpy/distutils
copying numpy/distutils/from_template.py ->
build/lib.linux-i686-2.6/numpy/distutils
copying numpy/distutils/pathccompiler.py ->
build/lib.linux-i686-2.6/numpy/distutils
copying numpy/distutils/core.py -> build/lib.linux-i686-2.6/numpy/distutils
copying numpy/distutils/log.py -> build/lib.linux-i686-2.6/numpy/distutils
copying numpy/distutils/compat.py -> build/lib.linux-i686-2.6/numpy/distutils
copying build/src.linux-i686-2.6/numpy/distutils/__config__.py ->
build/lib.linux-i686-2.6/numpy/distutils
creating build/lib.linux-i686-2.6/numpy/distutils/command
copying numpy/distutils/command/install.py ->
build/lib.linux-i686-2.6/numpy/distutils/command
copying numpy/distutils/command/__init__.py ->
build/lib.linux-i686-2.6/numpy/distutils/command
copying numpy/distutils/command/build_py.py ->
build/lib.linux-i686-2.6/numpy/distutils/command
copying numpy/distutils/command/build_clib.py ->
build/lib.linux-i686-2.6/numpy/distutils/command
copying numpy/distutils/command/develop.py ->
build/lib.linux-i686-2.6/numpy/distutils/command
copying numpy/distutils/command/install_headers.py ->
build/lib.linux-i686-2.6/numpy/distutils/command
copying numpy/distutils/command/sdist.py ->
build/lib.linux-i686-2.6/numpy/distutils/command
copying numpy/distutils/command/build_src.py ->
build/lib.linux-i686-2.6/numpy/distutils/command
copying numpy/distutils/command/install_clib.py ->
build/lib.linux-i686-2.6/numpy/distutils/command
copying numpy/distutils/command/bdist_rpm.py ->
build/lib.linux-i686-2.6/numpy/distutils/command
copying numpy/distutils/command/build.py ->
build/lib.linux-i686-2.6/numpy/distutils/command
copying numpy/distutils/command/scons.py ->
build/lib.linux-i686-2.6/numpy/distutils/command
copying numpy/distutils/command/egg_info.py ->
build/lib.linux-i686-2.6/numpy/distutils/command
copying numpy/distutils/command/build_ext.py ->
build/lib.linux-i686-2.6/numpy/distutils/command
copying numpy/distutils/command/autodist.py ->
build/lib.linux-i686-2.6/numpy/distutils/command
copying numpy/distutils/command/install_data.py ->
build/lib.linux-i686-2.6/numpy/distutils/command
copying numpy/distutils/command/config_compiler.py ->
build/lib.linux-i686-2.6/numpy/distutils/command
copying numpy/distutils/command/build_scripts.py ->
build/lib.linux-i686-2.6/numpy/distutils/command
copying numpy/distutils/command/config.py ->
build/lib.linux-i686-2.6/numpy/distutils/command
creating build/lib.linux-i686-2.6/numpy/distutils/fcompiler
copying numpy/distutils/fcompiler/pathf95.py ->
build/lib.linux-i686-2.6/numpy/distutils/fcompiler
copying numpy/distutils/fcompiler/gnu.py ->
build/lib.linux-i686-2.6/numpy/distutils/fcompiler
copying numpy/distutils/fcompiler/sun.py ->
build/lib.linux-i686-2.6/numpy/distutils/fcompiler
copying numpy/distutils/fcompiler/absoft.py ->
build/lib.linux-i686-2.6/numpy/distutils/fcompiler
copying numpy/distutils/fcompiler/g95.py ->
build/lib.linux-i686-2.6/numpy/distutils/fcompiler
copying numpy/distutils/fcompiler/__init__.py ->
build/lib.linux-i686-2.6/numpy/distutils/fcompiler
copying numpy/distutils/fcompiler/none.py ->
build/lib.linux-i686-2.6/numpy/distutils/fcompiler
copying numpy/distutils/fcompiler/nag.py ->
build/lib.linux-i686-2.6/numpy/distutils/fcompiler
copying numpy/distutils/fcompiler/lahey.py ->
build/lib.linux-i686-2.6/numpy/distutils/fcompiler
copying numpy/distutils/fcompiler/ibm.py ->
build/lib.linux-i686-2.6/numpy/distutils/fcompiler
copying numpy/distutils/fcompiler/compaq.py ->
build/lib.linux-i686-2.6/numpy/distutils/fcompiler
copying numpy/distutils/fcompiler/mips.py ->
build/lib.linux-i686-2.6/numpy/distutils/fcompiler
copying numpy/distutils/fcompiler/hpux.py ->
build/lib.linux-i686-2.6/numpy/distutils/fcompiler
copying numpy/distutils/fcompiler/vast.py ->
build/lib.linux-i686-2.6/numpy/distutils/fcompiler
copying numpy/distutils/fcompiler/pg.py ->
build/lib.linux-i686-2.6/numpy/distutils/fcompiler
copying numpy/distutils/fcompiler/intel.py ->
build/lib.linux-i686-2.6/numpy/distutils/fcompiler
creating build/lib.linux-i686-2.6/numpy/testing
copying numpy/testing/decorators.py -> build/lib.linux-i686-2.6/numpy/testing
copying numpy/testing/__init__.py -> build/lib.linux-i686-2.6/numpy/testing
copying numpy/testing/setupscons.py -> build/lib.linux-i686-2.6/numpy/testing
copying numpy/testing/nulltester.py -> build/lib.linux-i686-2.6/numpy/testing
copying numpy/testing/setup.py -> build/lib.linux-i686-2.6/numpy/testing
copying numpy/testing/print_coercion_tables.py ->
build/lib.linux-i686-2.6/numpy/testing
copying numpy/testing/noseclasses.py -> build/lib.linux-i686-2.6/numpy/testing
copying numpy/testing/utils.py -> build/lib.linux-i686-2.6/numpy/testing
copying numpy/testing/nosetester.py -> build/lib.linux-i686-2.6/numpy/testing
copying numpy/testing/numpytest.py -> build/lib.linux-i686-2.6/numpy/testing
creating build/lib.linux-i686-2.6/numpy/f2py
copying numpy/f2py/__init__.py -> build/lib.linux-i686-2.6/numpy/f2py
copying numpy/f2py/rules.py -> build/lib.linux-i686-2.6/numpy/f2py
copying numpy/f2py/f2py_testing.py -> build/lib.linux-i686-2.6/numpy/f2py
copying numpy/f2py/__version__.py -> build/lib.linux-i686-2.6/numpy/f2py
copying numpy/f2py/setupscons.py -> build/lib.linux-i686-2.6/numpy/f2py
copying numpy/f2py/setup.py -> build/lib.linux-i686-2.6/numpy/f2py
copying numpy/f2py/auxfuncs.py -> build/lib.linux-i686-2.6/numpy/f2py
copying numpy/f2py/info.py -> build/lib.linux-i686-2.6/numpy/f2py
copying numpy/f2py/crackfortran.py -> build/lib.linux-i686-2.6/numpy/f2py
copying numpy/f2py/use_rules.py -> build/lib.linux-i686-2.6/numpy/f2py
copying numpy/f2py/func2subr.py -> build/lib.linux-i686-2.6/numpy/f2py
copying numpy/f2py/f2py2e.py -> build/lib.linux-i686-2.6/numpy/f2py
copying numpy/f2py/cb_rules.py -> build/lib.linux-i686-2.6/numpy/f2py
copying numpy/f2py/diagnose.py -> build/lib.linux-i686-2.6/numpy/f2py
copying numpy/f2py/capi_maps.py -> build/lib.linux-i686-2.6/numpy/f2py
copying numpy/f2py/f90mod_rules.py -> build/lib.linux-i686-2.6/numpy/f2py
copying numpy/f2py/cfuncs.py -> build/lib.linux-i686-2.6/numpy/f2py
copying numpy/f2py/common_rules.py -> build/lib.linux-i686-2.6/numpy/f2py
creating build/lib.linux-i686-2.6/numpy/core
copying numpy/core/setup_common.py -> build/lib.linux-i686-2.6/numpy/core
copying numpy/core/numerictypes.py -> build/lib.linux-i686-2.6/numpy/core
copying numpy/core/shape_base.py -> build/lib.linux-i686-2.6/numpy/core
copying numpy/core/numeric.py -> build/lib.linux-i686-2.6/numpy/core
copying numpy/core/__init__.py -> build/lib.linux-i686-2.6/numpy/core
copying numpy/core/_mx_datetime_parser.py -> build/lib.linux-i686-2.6/numpy/core
copying numpy/core/setupscons.py -> build/lib.linux-i686-2.6/numpy/core
copying numpy/core/setup.py -> build/lib.linux-i686-2.6/numpy/core
copying numpy/core/info.py -> build/lib.linux-i686-2.6/numpy/core
copying numpy/core/defchararray.py -> build/lib.linux-i686-2.6/numpy/core
copying numpy/core/function_base.py -> build/lib.linux-i686-2.6/numpy/core
copying numpy/core/fromnumeric.py -> build/lib.linux-i686-2.6/numpy/core
copying numpy/core/records.py -> build/lib.linux-i686-2.6/numpy/core
copying numpy/core/getlimits.py -> build/lib.linux-i686-2.6/numpy/core
copying numpy/core/_internal.py -> build/lib.linux-i686-2.6/numpy/core
copying numpy/core/scons_support.py -> build/lib.linux-i686-2.6/numpy/core
copying numpy/core/machar.py -> build/lib.linux-i686-2.6/numpy/core
copying numpy/core/memmap.py -> build/lib.linux-i686-2.6/numpy/core
copying numpy/core/arrayprint.py -> build/lib.linux-i686-2.6/numpy/core
copying numpy/core/code_generators/generate_numpy_api.py ->
build/lib.linux-i686-2.6/numpy/core
creating build/lib.linux-i686-2.6/numpy/lib
copying numpy/lib/shape_base.py -> build/lib.linux-i686-2.6/numpy/lib
copying numpy/lib/__init__.py -> build/lib.linux-i686-2.6/numpy/lib
copying numpy/lib/_datasource.py -> build/lib.linux-i686-2.6/numpy/lib
copying numpy/lib/setupscons.py -> build/lib.linux-i686-2.6/numpy/lib
copying numpy/lib/arraysetops.py -> build/lib.linux-i686-2.6/numpy/lib
copying numpy/lib/setup.py -> build/lib.linux-i686-2.6/numpy/lib
copying numpy/lib/info.py -> build/lib.linux-i686-2.6/numpy/lib
copying numpy/lib/format.py -> build/lib.linux-i686-2.6/numpy/lib
copying numpy/lib/arrayterator.py -> build/lib.linux-i686-2.6/numpy/lib
copying numpy/lib/user_array.py -> build/lib.linux-i686-2.6/numpy/lib
copying numpy/lib/_iotools.py -> build/lib.linux-i686-2.6/numpy/lib
copying numpy/lib/recfunctions.py -> build/lib.linux-i686-2.6/numpy/lib
copying numpy/lib/financial.py -> build/lib.linux-i686-2.6/numpy/lib
copying numpy/lib/function_base.py -> build/lib.linux-i686-2.6/numpy/lib
copying numpy/lib/ufunclike.py -> build/lib.linux-i686-2.6/numpy/lib
copying numpy/lib/scimath.py -> build/lib.linux-i686-2.6/numpy/lib
copying numpy/lib/twodim_base.py -> build/lib.linux-i686-2.6/numpy/lib
copying numpy/lib/index_tricks.py -> build/lib.linux-i686-2.6/numpy/lib
copying numpy/lib/polynomial.py -> build/lib.linux-i686-2.6/numpy/lib
copying numpy/lib/utils.py -> build/lib.linux-i686-2.6/numpy/lib
copying numpy/lib/stride_tricks.py -> build/lib.linux-i686-2.6/numpy/lib
copying numpy/lib/type_check.py -> build/lib.linux-i686-2.6/numpy/lib
copying numpy/lib/npyio.py -> build/lib.linux-i686-2.6/numpy/lib
creating build/lib.linux-i686-2.6/numpy/oldnumeric
copying numpy/oldnumeric/alter_code2.py ->
build/lib.linux-i686-2.6/numpy/oldnumeric
copying numpy/oldnumeric/typeconv.py ->
build/lib.linux-i686-2.6/numpy/oldnumeric
copying numpy/oldnumeric/__init__.py ->
build/lib.linux-i686-2.6/numpy/oldnumeric
copying numpy/oldnumeric/fft.py -> build/lib.linux-i686-2.6/numpy/oldnumeric
copying numpy/oldnumeric/setupscons.py ->
build/lib.linux-i686-2.6/numpy/oldnumeric
copying numpy/oldnumeric/setup.py -> build/lib.linux-i686-2.6/numpy/oldnumeric
copying numpy/oldnumeric/alter_code1.py ->
build/lib.linux-i686-2.6/numpy/oldnumeric
copying numpy/oldnumeric/arrayfns.py ->
build/lib.linux-i686-2.6/numpy/oldnumeric
copying numpy/oldnumeric/ufuncs.py -> build/lib.linux-i686-2.6/numpy/oldnumeric
copying numpy/oldnumeric/misc.py -> build/lib.linux-i686-2.6/numpy/oldnumeric
copying numpy/oldnumeric/user_array.py ->
build/lib.linux-i686-2.6/numpy/oldnumeric
copying numpy/oldnumeric/linear_algebra.py ->
build/lib.linux-i686-2.6/numpy/oldnumeric
copying numpy/oldnumeric/matrix.py -> build/lib.linux-i686-2.6/numpy/oldnumeric
copying numpy/oldnumeric/ma.py -> build/lib.linux-i686-2.6/numpy/oldnumeric
copying numpy/oldnumeric/functions.py ->
build/lib.linux-i686-2.6/numpy/oldnumeric
copying numpy/oldnumeric/random_array.py ->
build/lib.linux-i686-2.6/numpy/oldnumeric
copying numpy/oldnumeric/precision.py ->
build/lib.linux-i686-2.6/numpy/oldnumeric
copying numpy/oldnumeric/mlab.py -> build/lib.linux-i686-2.6/numpy/oldnumeric
copying numpy/oldnumeric/rng_stats.py ->
build/lib.linux-i686-2.6/numpy/oldnumeric
copying numpy/oldnumeric/rng.py -> build/lib.linux-i686-2.6/numpy/oldnumeric
copying numpy/oldnumeric/compat.py -> build/lib.linux-i686-2.6/numpy/oldnumeric
copying numpy/oldnumeric/fix_default_axis.py ->
build/lib.linux-i686-2.6/numpy/oldnumeric
copying numpy/oldnumeric/array_printer.py ->
build/lib.linux-i686-2.6/numpy/oldnumeric
creating build/lib.linux-i686-2.6/numpy/numarray
copying numpy/numarray/numerictypes.py ->
build/lib.linux-i686-2.6/numpy/numarray
copying numpy/numarray/alter_code2.py -> build/lib.linux-i686-2.6/numpy/numarray
copying numpy/numarray/nd_image.py -> build/lib.linux-i686-2.6/numpy/numarray
copying numpy/numarray/__init__.py -> build/lib.linux-i686-2.6/numpy/numarray
copying numpy/numarray/fft.py -> build/lib.linux-i686-2.6/numpy/numarray
copying numpy/numarray/setupscons.py -> build/lib.linux-i686-2.6/numpy/numarray
copying numpy/numarray/setup.py -> build/lib.linux-i686-2.6/numpy/numarray
copying numpy/numarray/alter_code1.py -> build/lib.linux-i686-2.6/numpy/numarray
copying numpy/numarray/ufuncs.py -> build/lib.linux-i686-2.6/numpy/numarray
copying numpy/numarray/linear_algebra.py ->
build/lib.linux-i686-2.6/numpy/numarray
copying numpy/numarray/matrix.py -> build/lib.linux-i686-2.6/numpy/numarray
copying numpy/numarray/ma.py -> build/lib.linux-i686-2.6/numpy/numarray
copying numpy/numarray/functions.py -> build/lib.linux-i686-2.6/numpy/numarray
copying numpy/numarray/convolve.py -> build/lib.linux-i686-2.6/numpy/numarray
copying numpy/numarray/image.py -> build/lib.linux-i686-2.6/numpy/numarray
copying numpy/numarray/random_array.py ->
build/lib.linux-i686-2.6/numpy/numarray
copying numpy/numarray/util.py -> build/lib.linux-i686-2.6/numpy/numarray
copying numpy/numarray/mlab.py -> build/lib.linux-i686-2.6/numpy/numarray
copying numpy/numarray/session.py -> build/lib.linux-i686-2.6/numpy/numarray
copying numpy/numarray/compat.py -> build/lib.linux-i686-2.6/numpy/numarray
creating build/lib.linux-i686-2.6/numpy/fft
copying numpy/fft/fftpack.py -> build/lib.linux-i686-2.6/numpy/fft
copying numpy/fft/__init__.py -> build/lib.linux-i686-2.6/numpy/fft
copying numpy/fft/setupscons.py -> build/lib.linux-i686-2.6/numpy/fft
copying numpy/fft/setup.py -> build/lib.linux-i686-2.6/numpy/fft
copying numpy/fft/info.py -> build/lib.linux-i686-2.6/numpy/fft
copying numpy/fft/helper.py -> build/lib.linux-i686-2.6/numpy/fft
creating build/lib.linux-i686-2.6/numpy/linalg
copying numpy/linalg/__init__.py -> build/lib.linux-i686-2.6/numpy/linalg
copying numpy/linalg/setupscons.py -> build/lib.linux-i686-2.6/numpy/linalg
copying numpy/linalg/setup.py -> build/lib.linux-i686-2.6/numpy/linalg
copying numpy/linalg/info.py -> build/lib.linux-i686-2.6/numpy/linalg
copying numpy/linalg/linalg.py -> build/lib.linux-i686-2.6/numpy/linalg
creating build/lib.linux-i686-2.6/numpy/random
copying numpy/random/__init__.py -> build/lib.linux-i686-2.6/numpy/random
copying numpy/random/setupscons.py -> build/lib.linux-i686-2.6/numpy/random
copying numpy/random/setup.py -> build/lib.linux-i686-2.6/numpy/random
copying numpy/random/info.py -> build/lib.linux-i686-2.6/numpy/random
creating build/lib.linux-i686-2.6/numpy/ma
copying numpy/ma/mrecords.py -> build/lib.linux-i686-2.6/numpy/ma
copying numpy/ma/extras.py -> build/lib.linux-i686-2.6/numpy/ma
copying numpy/ma/version.py -> build/lib.linux-i686-2.6/numpy/ma
copying numpy/ma/__init__.py -> build/lib.linux-i686-2.6/numpy/ma
copying numpy/ma/setupscons.py -> build/lib.linux-i686-2.6/numpy/ma
copying numpy/ma/setup.py -> build/lib.linux-i686-2.6/numpy/ma
copying numpy/ma/testutils.py -> build/lib.linux-i686-2.6/numpy/ma
copying numpy/ma/timer_comparison.py -> build/lib.linux-i686-2.6/numpy/ma
copying numpy/ma/bench.py -> build/lib.linux-i686-2.6/numpy/ma
copying numpy/ma/core.py -> build/lib.linux-i686-2.6/numpy/ma
creating build/lib.linux-i686-2.6/numpy/matrixlib
copying numpy/matrixlib/defmatrix.py -> build/lib.linux-i686-2.6/numpy/matrixlib
copying numpy/matrixlib/__init__.py -> build/lib.linux-i686-2.6/numpy/matrixlib
copying numpy/matrixlib/setupscons.py ->
build/lib.linux-i686-2.6/numpy/matrixlib
copying numpy/matrixlib/setup.py -> build/lib.linux-i686-2.6/numpy/matrixlib
creating build/lib.linux-i686-2.6/numpy/compat
copying numpy/compat/__init__.py -> build/lib.linux-i686-2.6/numpy/compat
copying numpy/compat/py3k.py -> build/lib.linux-i686-2.6/numpy/compat
copying numpy/compat/setupscons.py -> build/lib.linux-i686-2.6/numpy/compat
copying numpy/compat/setup.py -> build/lib.linux-i686-2.6/numpy/compat
copying numpy/compat/_inspect.py -> build/lib.linux-i686-2.6/numpy/compat
creating build/lib.linux-i686-2.6/numpy/polynomial
copying numpy/polynomial/legendre.py ->
build/lib.linux-i686-2.6/numpy/polynomial
copying numpy/polynomial/__init__.py ->
build/lib.linux-i686-2.6/numpy/polynomial
copying numpy/polynomial/hermite.py -> build/lib.linux-i686-2.6/numpy/polynomial
copying numpy/polynomial/polyutils.py ->
build/lib.linux-i686-2.6/numpy/polynomial
copying numpy/polynomial/setup.py -> build/lib.linux-i686-2.6/numpy/polynomial
copying numpy/polynomial/chebyshev.py ->
build/lib.linux-i686-2.6/numpy/polynomial
copying numpy/polynomial/polynomial.py ->
build/lib.linux-i686-2.6/numpy/polynomial
copying numpy/polynomial/hermite_e.py ->
build/lib.linux-i686-2.6/numpy/polynomial
copying numpy/polynomial/laguerre.py ->
build/lib.linux-i686-2.6/numpy/polynomial
copying numpy/polynomial/polytemplate.py ->
build/lib.linux-i686-2.6/numpy/polynomial
creating build/lib.linux-i686-2.6/numpy/doc
copying numpy/doc/__init__.py -> build/lib.linux-i686-2.6/numpy/doc
copying numpy/doc/methods_vs_functions.py -> build/lib.linux-i686-2.6/numpy/doc
copying numpy/doc/basics.py -> build/lib.linux-i686-2.6/numpy/doc
copying numpy/doc/creation.py -> build/lib.linux-i686-2.6/numpy/doc
copying numpy/doc/ufuncs.py -> build/lib.linux-i686-2.6/numpy/doc
copying numpy/doc/misc.py -> build/lib.linux-i686-2.6/numpy/doc
copying numpy/doc/indexing.py -> build/lib.linux-i686-2.6/numpy/doc
copying numpy/doc/byteswapping.py -> build/lib.linux-i686-2.6/numpy/doc
copying numpy/doc/performance.py -> build/lib.linux-i686-2.6/numpy/doc
copying numpy/doc/subclassing.py -> build/lib.linux-i686-2.6/numpy/doc
copying numpy/doc/io.py -> build/lib.linux-i686-2.6/numpy/doc
copying numpy/doc/broadcasting.py -> build/lib.linux-i686-2.6/numpy/doc
copying numpy/doc/internals.py -> build/lib.linux-i686-2.6/numpy/doc
copying numpy/doc/jargon.py -> build/lib.linux-i686-2.6/numpy/doc
copying numpy/doc/structured_arrays.py -> build/lib.linux-i686-2.6/numpy/doc
copying numpy/doc/constants.py -> build/lib.linux-i686-2.6/numpy/doc
copying numpy/doc/howtofind.py -> build/lib.linux-i686-2.6/numpy/doc
copying numpy/doc/glossary.py -> build/lib.linux-i686-2.6/numpy/doc
running build_clib
customize UnixCCompiler
customize UnixCCompiler using build_clib
building 'npymath' library
compiling C sources
C compiler: gcc -pthread -fno-strict-aliasing -DNDEBUG -g -fwrapv -O2
-Wall -Wstrict-prototypes -fPIC

creating build/temp.linux-i686-2.6
creating build/temp.linux-i686-2.6/build
creating build/temp.linux-i686-2.6/build/src.linux-i686-2.6
creating build/temp.linux-i686-2.6/build/src.linux-i686-2.6/numpy
creating build/temp.linux-i686-2.6/build/src.linux-i686-2.6/numpy/core
creating build/temp.linux-i686-2.6/build/src.linux-i686-2.6/numpy/core/src
creating build/temp.linux-i686-2.6/build/src.linux-i686-2.6/numpy/core/src/npymath
creating build/temp.linux-i686-2.6/numpy
creating build/temp.linux-i686-2.6/numpy/core
creating build/temp.linux-i686-2.6/numpy/core/src
creating build/temp.linux-i686-2.6/numpy/core/src/npymath
compile options: '-Inumpy/core/include
-Ibuild/src.linux-i686-2.6/numpy/core/include/numpy
-Inumpy/core/src/private -Inumpy/core/src -Inumpy/core
-Inumpy/core/src/npymath -Inumpy/core/src/multiarray
-Inumpy/core/src/umath -Inumpy/core/include -I/usr/include/python2.6
-Ibuild/src.linux-i686-2.6/numpy/core/src/multiarray
-Ibuild/src.linux-i686-2.6/numpy/core/src/umath -c'
gcc: build/src.linux-i686-2.6/numpy/core/src/npymath/npy_math_complex.c
gcc: numpy/core/src/npymath/halffloat.c
gcc: build/src.linux-i686-2.6/numpy/core/src/npymath/npy_math.c
gcc: build/src.linux-i686-2.6/numpy/core/src/npymath/ieee754.c
ar: adding 4 object files to build/temp.linux-i686-2.6/libnpymath.a
running build_ext
customize UnixCCompiler
customize UnixCCompiler using build_ext
customize Gnu95FCompiler
customize Gnu95FCompiler using build_ext
building 'numpy.core._sort' extension
compiling C sources
C compiler: gcc -pthread -fno-strict-aliasing -DNDEBUG -g -fwrapv -O2
-Wall -Wstrict-prototypes -fPIC

compile options: '-Inumpy/core/include
-Ibuild/src.linux-i686-2.6/numpy/core/include/numpy
-Inumpy/core/src/private -Inumpy/core/src -Inumpy/core
-Inumpy/core/src/npymath -Inumpy/core/src/multiarray
-Inumpy/core/src/umath -Inumpy/core/include -I/usr/include/python2.6
-Ibuild/src.linux-i686-2.6/numpy/core/src/multiarray
-Ibuild/src.linux-i686-2.6/numpy/core/src/umath -c'
gcc: build/src.linux-i686-2.6/numpy/core/src/_sortmodule.c
gcc -pthread -shared -Wl,-O1 -Wl,-Bsymbolic-functions
build/temp.linux-i686-2.6/build/src.linux-i686-2.6/numpy/core/src/_sortmodule.o
-Lbuild/temp.linux-i686-2.6 -lnpymath -lm -o
build/lib.linux-i686-2.6/numpy/core/_sort.so
building 'numpy.core.multiarray' extension
compiling C sources
C compiler: gcc -pthread -fno-strict-aliasing -DNDEBUG -g -fwrapv -O2
-Wall -Wstrict-prototypes -fPIC

creating build/temp.linux-i686-2.6/numpy/core/src/multiarray
compile options: '-Inumpy/core/include
-Ibuild/src.linux-i686-2.6/numpy/core/include/numpy
-Inumpy/core/src/private -Inumpy/core/src -Inumpy/core
-Inumpy/core/src/npymath -Inumpy/core/src/multiarray
-Inumpy/core/src/umath -Inumpy/core/include -I/usr/include/python2.6
-Ibuild/src.linux-i686-2.6/numpy/core/src/multiarray
-Ibuild/src.linux-i686-2.6/numpy/core/src/umath -c'
gcc: numpy/core/src/multiarray/multiarraymodule_onefile.c
numpy/core/src/multiarray/mapping.c:74: warning: ‘_array_ass_item’
defined but not used
build/src.linux-i686-2.6/numpy/core/include/numpy/__ufunc_api.h:226:
warning: ‘_import_umath’ defined but not used
gcc -pthread -shared -Wl,-O1 -Wl,-Bsymbolic-functions
build/temp.linux-i686-2.6/numpy/core/src/multiarray/multiarraymodule_onefile.o
-Lbuild/temp.linux-i686-2.6 -lnpymath -lm -o
build/lib.linux-i686-2.6/numpy/core/multiarray.so
building 'numpy.core.umath' extension
compiling C sources
C compiler: gcc -pthread -fno-strict-aliasing -DNDEBUG -g -fwrapv -O2
-Wall -Wstrict-prototypes -fPIC

creating build/temp.linux-i686-2.6/numpy/core/src/umath
compile options: '-Ibuild/src.linux-i686-2.6/numpy/core/src/umath
-Inumpy/core/include
-Ibuild/src.linux-i686-2.6/numpy/core/include/numpy
-Inumpy/core/src/private -Inumpy/core/src -Inumpy/core
-Inumpy/core/src/npymath -Inumpy/core/src/multiarray
-Inumpy/core/src/umath -Inumpy/core/include -I/usr/include/python2.6
-Ibuild/src.linux-i686-2.6/numpy/core/src/multiarray
-Ibuild/src.linux-i686-2.6/numpy/core/src/umath -c'
gcc: numpy/core/src/umath/umathmodule_onefile.c
numpy/core/include/numpy/npy_3kcompat.h:391: warning:
‘simple_capsule_dtor’ defined but not used
numpy/core/src/umath/loops.c.src:1402: warning: ‘FLOAT_ldexp_long’
defined but not used
numpy/core/src/umath/loops.c.src:1402: warning: ‘DOUBLE_ldexp_long’
defined but not used
numpy/core/src/umath/loops.c.src:1402: warning:
‘LONGDOUBLE_ldexp_long’ defined but not used
numpy/core/src/umath/loops.c.src:1709: warning: ‘HALF_ldexp_long’
defined but not used
numpy/core/src/private/lowlevel_strided_loops.h:36: warning:
‘PyArray_FreeStridedTransferData’ declared ‘static’ but never defined
numpy/core/src/private/lowlevel_strided_loops.h:43: warning:
‘PyArray_CopyStridedTransferData’ declared ‘static’ but never defined
numpy/core/src/private/lowlevel_strided_loops.h:63: warning:
‘PyArray_GetStridedCopyFn’ declared ‘static’ but never defined
numpy/core/src/private/lowlevel_strided_loops.h:77: warning:
‘PyArray_GetStridedCopySwapFn’ declared ‘static’ but never defined
numpy/core/src/private/lowlevel_strided_loops.h:91: warning:
‘PyArray_GetStridedCopySwapPairFn’ declared ‘static’ but never defined
numpy/core/src/private/lowlevel_strided_loops.h:105: warning:
‘PyArray_GetStridedZeroPadCopyFn’ declared ‘static’ but never defined
numpy/core/src/private/lowlevel_strided_loops.h:118: warning:
‘PyArray_GetStridedNumericCastFn’ declared ‘static’ but never defined
numpy/core/src/private/lowlevel_strided_loops.h:168: warning:
‘PyArray_GetDTypeTransferFunction’ declared ‘static’ but never defined
numpy/core/src/private/lowlevel_strided_loops.h:220: warning:
‘PyArray_TransferNDimToStrided’ declared ‘static’ but never defined
numpy/core/src/private/lowlevel_strided_loops.h:230: warning:
‘PyArray_TransferStridedToNDim’ declared ‘static’ but never defined
gcc -pthread -shared -Wl,-O1 -Wl,-Bsymbolic-functions
build/temp.linux-i686-2.6/numpy/core/src/umath/umathmodule_onefile.o
-Lbuild/temp.linux-i686-2.6 -lnpymath -lm -o
build/lib.linux-i686-2.6/numpy/core/umath.so
building 'numpy.core.scalarmath' extension
compiling C sources
C compiler: gcc -pthread -fno-strict-aliasing -DNDEBUG -g -fwrapv -O2
-Wall -Wstrict-prototypes -fPIC

compile options: '-Inumpy/core/include
-Ibuild/src.linux-i686-2.6/numpy/core/include/numpy
-Inumpy/core/src/private -Inumpy/core/src -Inumpy/core
-Inumpy/core/src/npymath -Inumpy/core/src/multiarray
-Inumpy/core/src/umath -Inumpy/core/include -I/usr/include/python2.6
-Ibuild/src.linux-i686-2.6/numpy/core/src/multiarray
-Ibuild/src.linux-i686-2.6/numpy/core/src/umath -c'
gcc: build/src.linux-i686-2.6/numpy/core/src/scalarmathmodule.c
numpy/core/src/scalarmathmodule.c.src:1054: warning: function
declaration isn’t a prototype
numpy/core/include/numpy/npy_3kcompat.h:391: warning:
‘simple_capsule_dtor’ defined but not used
gcc -pthread -shared -Wl,-O1 -Wl,-Bsymbolic-functions
build/temp.linux-i686-2.6/build/src.linux-i686-2.6/numpy/core/src/scalarmathmodule.o
-Lbuild/temp.linux-i686-2.6 -lnpymath -lm -o
build/lib.linux-i686-2.6/numpy/core/scalarmath.so
building 'numpy.core._dotblas' extension
compiling C sources
C compiler: gcc -pthread -fno-strict-aliasing -DNDEBUG -g -fwrapv -O2
-Wall -Wstrict-prototypes -fPIC

creating build/temp.linux-i686-2.6/numpy/core/blasdot
compile options: '-DATLAS_INFO="\"3.6.0\"" -Inumpy/core/blasdot
-I/usr/include -Inumpy/core/include
-Ibuild/src.linux-i686-2.6/numpy/core/include/numpy
-Inumpy/core/src/private -Inumpy/core/src -Inumpy/core
-Inumpy/core/src/npymath -Inumpy/core/src/multiarray
-Inumpy/core/src/umath -Inumpy/core/include -I/usr/include/python2.6
-Ibuild/src.linux-i686-2.6/numpy/core/src/multiarray
-Ibuild/src.linux-i686-2.6/numpy/core/src/umath -c'
gcc: numpy/core/blasdot/_dotblas.c
numpy/core/blasdot/_dotblas.c: In function ‘dotblas_matrixproduct’:
numpy/core/blasdot/_dotblas.c:239: warning: comparison of distinct
pointer types lacks a cast
numpy/core/blasdot/_dotblas.c:257: warning: passing argument 3 of
‘(struct PyObject * (*)(struct PyObject *, struct PyObject *, struct
PyArrayObject *))*(PyArray_API + 1120u)’ from incompatible pointer
type
numpy/core/blasdot/_dotblas.c:257: note: expected ‘struct
PyArrayObject *’ but argument is of type ‘struct PyObject *’
numpy/core/blasdot/_dotblas.c:292: warning: passing argument 3 of
‘(struct PyObject * (*)(struct PyObject *, struct PyObject *, struct
PyArrayObject *))*(PyArray_API + 1120u)’ from incompatible pointer
type
numpy/core/blasdot/_dotblas.c:292: note: expected ‘struct
PyArrayObject *’ but argument is of type ‘struct PyObject *’
gcc -pthread -shared -Wl,-O1 -Wl,-Bsymbolic-functions
build/temp.linux-i686-2.6/numpy/core/blasdot/_dotblas.o -L/usr/lib/sse
-Lbuild/temp.linux-i686-2.6 -lf77blas -lcblas -latlas -o
build/lib.linux-i686-2.6/numpy/core/_dotblas.so
building 'numpy.core.umath_tests' extension
compiling C sources
C compiler: gcc -pthread -fno-strict-aliasing -DNDEBUG -g -fwrapv -O2
-Wall -Wstrict-prototypes -fPIC

creating build/temp.linux-i686-2.6/build/src.linux-i686-2.6/numpy/core/src/umath
compile options: '-Inumpy/core/include
-Ibuild/src.linux-i686-2.6/numpy/core/include/numpy
-Inumpy/core/src/private -Inumpy/core/src -Inumpy/core
-Inumpy/core/src/npymath -Inumpy/core/src/multiarray
-Inumpy/core/src/umath -Inumpy/core/include -I/usr/include/python2.6
-Ibuild/src.linux-i686-2.6/numpy/core/src/multiarray
-Ibuild/src.linux-i686-2.6/numpy/core/src/umath -c'
gcc: build/src.linux-i686-2.6/numpy/core/src/umath/umath_tests.c
numpy/core/include/numpy/npy_3kcompat.h:391: warning:
‘simple_capsule_dtor’ defined but not used
gcc -pthread -shared -Wl,-O1 -Wl,-Bsymbolic-functions
build/temp.linux-i686-2.6/build/src.linux-i686-2.6/numpy/core/src/umath/umath_tests.o
-Lbuild/temp.linux-i686-2.6 -o
build/lib.linux-i686-2.6/numpy/core/umath_tests.so
building 'numpy.core.multiarray_tests' extension
compiling C sources
C compiler: gcc -pthread -fno-strict-aliasing -DNDEBUG -g -fwrapv -O2
-Wall -Wstrict-prototypes -fPIC

creating build/temp.linux-i686-2.6/build/src.linux-i686-2.6/numpy/core/src/multiarray
compile options: '-Inumpy/core/include
-Ibuild/src.linux-i686-2.6/numpy/core/include/numpy
-Inumpy/core/src/private -Inumpy/core/src -Inumpy/core
-Inumpy/core/src/npymath -Inumpy/core/src/multiarray
-Inumpy/core/src/umath -Inumpy/core/include -I/usr/include/python2.6
-Ibuild/src.linux-i686-2.6/numpy/core/src/multiarray
-Ibuild/src.linux-i686-2.6/numpy/core/src/umath -c'
gcc: build/src.linux-i686-2.6/numpy/core/src/multiarray/multiarray_tests.c
numpy/core/include/numpy/npy_3kcompat.h:391: warning:
‘simple_capsule_dtor’ defined but not used
gcc -pthread -shared -Wl,-O1 -Wl,-Bsymbolic-functions
build/temp.linux-i686-2.6/build/src.linux-i686-2.6/numpy/core/src/multiarray/multiarray_tests.o
-Lbuild/temp.linux-i686-2.6 -o
build/lib.linux-i686-2.6/numpy/core/multiarray_tests.so
building 'numpy.lib._compiled_base' extension
compiling C sources
C compiler: gcc -pthread -fno-strict-aliasing -DNDEBUG -g -fwrapv -O2
-Wall -Wstrict-prototypes -fPIC

creating build/temp.linux-i686-2.6/numpy/lib
creating build/temp.linux-i686-2.6/numpy/lib/src
compile options: '-Inumpy/core/include
-Ibuild/src.linux-i686-2.6/numpy/core/include/numpy
-Inumpy/core/src/private -Inumpy/core/src -Inumpy/core
-Inumpy/core/src/npymath -Inumpy/core/src/multiarray
-Inumpy/core/src/umath -Inumpy/core/include -I/usr/include/python2.6
-Ibuild/src.linux-i686-2.6/numpy/core/src/multiarray
-Ibuild/src.linux-i686-2.6/numpy/core/src/umath -c'
gcc: numpy/lib/src/_compiled_base.c
gcc -pthread -shared -Wl,-O1 -Wl,-Bsymbolic-functions
build/temp.linux-i686-2.6/numpy/lib/src/_compiled_base.o
-Lbuild/temp.linux-i686-2.6 -o
build/lib.linux-i686-2.6/numpy/lib/_compiled_base.so
building 'numpy.numarray._capi' extension
compiling C sources
C compiler: gcc -pthread -fno-strict-aliasing -DNDEBUG -g -fwrapv -O2
-Wall -Wstrict-prototypes -fPIC

creating build/temp.linux-i686-2.6/numpy/numarray
compile options: '-Inumpy/core/include
-Ibuild/src.linux-i686-2.6/numpy/core/include/numpy
-Inumpy/core/src/private -Inumpy/core/src -Inumpy/core
-Inumpy/core/src/npymath -Inumpy/core/src/multiarray
-Inumpy/core/src/umath -Inumpy/core/include -I/usr/include/python2.6
-Ibuild/src.linux-i686-2.6/numpy/core/src/multiarray
-Ibuild/src.linux-i686-2.6/numpy/core/src/umath -c'
gcc: numpy/numarray/_capi.c
numpy/core/include/numpy/npy_3kcompat.h:391: warning:
‘simple_capsule_dtor’ defined but not used
gcc -pthread -shared -Wl,-O1 -Wl,-Bsymbolic-functions
build/temp.linux-i686-2.6/numpy/numarray/_capi.o
-Lbuild/temp.linux-i686-2.6 -o
build/lib.linux-i686-2.6/numpy/numarray/_capi.so
building 'numpy.fft.fftpack_lite' extension
compiling C sources
C compiler: gcc -pthread -fno-strict-aliasing -DNDEBUG -g -fwrapv -O2
-Wall -Wstrict-prototypes -fPIC

creating build/temp.linux-i686-2.6/numpy/fft
compile options: '-Inumpy/core/include
-Ibuild/src.linux-i686-2.6/numpy/core/include/numpy
-Inumpy/core/src/private -Inumpy/core/src -Inumpy/core
-Inumpy/core/src/npymath -Inumpy/core/src/multiarray
-Inumpy/core/src/umath -Inumpy/core/include -I/usr/include/python2.6
-Ibuild/src.linux-i686-2.6/numpy/core/src/multiarray
-Ibuild/src.linux-i686-2.6/numpy/core/src/umath -c'
gcc: numpy/fft/fftpack_litemodule.c
gcc: numpy/fft/fftpack.c
gcc -pthread -shared -Wl,-O1 -Wl,-Bsymbolic-functions
build/temp.linux-i686-2.6/numpy/fft/fftpack_litemodule.o
build/temp.linux-i686-2.6/numpy/fft/fftpack.o
-Lbuild/temp.linux-i686-2.6 -o
build/lib.linux-i686-2.6/numpy/fft/fftpack_lite.so
building 'numpy.linalg.lapack_lite' extension
compiling C sources
C compiler: gcc -pthread -fno-strict-aliasing -DNDEBUG -g -fwrapv -O2
-Wall -Wstrict-prototypes -fPIC

creating build/temp.linux-i686-2.6/numpy/linalg
compile options: '-DATLAS_INFO="\"3.6.0\"" -I/usr/include
-Inumpy/core/include
-Ibuild/src.linux-i686-2.6/numpy/core/include/numpy
-Inumpy/core/src/private -Inumpy/core/src -Inumpy/core
-Inumpy/core/src/npymath -Inumpy/core/src/multiarray
-Inumpy/core/src/umath -Inumpy/core/include -I/usr/include/python2.6
-Ibuild/src.linux-i686-2.6/numpy/core/src/multiarray
-Ibuild/src.linux-i686-2.6/numpy/core/src/umath -c'
gcc: numpy/linalg/lapack_litemodule.c
gcc: numpy/linalg/python_xerbla.c
/usr/bin/gfortran -Wall -Wall -shared
build/temp.linux-i686-2.6/numpy/linalg/lapack_litemodule.o
build/temp.linux-i686-2.6/numpy/linalg/python_xerbla.o
-L/usr/lib/sse/atlas -L/usr/lib/sse -Lbuild/temp.linux-i686-2.6
-llapack -lf77blas -lcblas -latlas -lgfortran -o
build/lib.linux-i686-2.6/numpy/linalg/lapack_lite.so
building 'numpy.random.mtrand' extension
compiling C sources
C compiler: gcc -pthread -fno-strict-aliasing -DNDEBUG -g -fwrapv -O2
-Wall -Wstrict-prototypes -fPIC

creating build/temp.linux-i686-2.6/numpy/random
creating build/temp.linux-i686-2.6/numpy/random/mtrand
compile options: '-Inumpy/core/include
-Ibuild/src.linux-i686-2.6/numpy/core/include/numpy
-Inumpy/core/src/private -Inumpy/core/src -Inumpy/core
-Inumpy/core/src/npymath -Inumpy/core/src/multiarray
-Inumpy/core/src/umath -Inumpy/core/include -I/usr/include/python2.6
-Ibuild/src.linux-i686-2.6/numpy/core/src/multiarray
-Ibuild/src.linux-i686-2.6/numpy/core/src/umath -c'
gcc: numpy/random/mtrand/distributions.c
gcc: numpy/random/mtrand/initarray.c
gcc: numpy/random/mtrand/randomkit.c
gcc: numpy/random/mtrand/mtrand.c
gcc -pthread -shared -Wl,-O1 -Wl,-Bsymbolic-functions
build/temp.linux-i686-2.6/numpy/random/mtrand/mtrand.o
build/temp.linux-i686-2.6/numpy/random/mtrand/randomkit.o
build/temp.linux-i686-2.6/numpy/random/mtrand/initarray.o
build/temp.linux-i686-2.6/numpy/random/mtrand/distributions.o
-Lbuild/temp.linux-i686-2.6 -o
build/lib.linux-i686-2.6/numpy/random/mtrand.so
running scons
running build_scripts
creating build/scripts.linux-i686-2.6
Creating build/scripts.linux-i686-2.6/f2py
  adding 'build/scripts.linux-i686-2.6/f2py' to scripts
changing mode of build/scripts.linux-i686-2.6/f2py from 644 to 755
ryan@ryan-hpdv4|12:20 PM|numpy-1.6.1$


Here is the output of the install command:

ryan@ryan-hpdv4|12:27 PM|numpy-1.6.1$ sudo python setup.py install
Running from numpy source directory.F2PY Version 2
blas_opt_info:
blas_mkl_info:
  libraries mkl,vml,guide not found in /usr/lib
  NOT AVAILABLE

atlas_blas_threads_info:
Setting PTATLAS=ATLAS
  libraries ptf77blas,ptcblas,atlas not found in /usr/lib/atlas
  libraries ptf77blas,ptcblas,atlas not found in /usr/lib/sse
  libraries ptf77blas,ptcblas,atlas not found in /usr/lib/sse2
  libraries ptf77blas,ptcblas,atlas not found in /usr/lib
  NOT AVAILABLE

atlas_blas_info:
  libraries f77blas,cblas,atlas not found in /usr/lib/atlas
/home/ryan/Downloads/numpy-1.6.1/numpy/distutils/command/config.py:413:
DeprecationWarning:
+++++++++++++++++++++++++++++++++++++++++++++++++
Usage of get_output is deprecated: please do not
use it anymore, and avoid configuration checks
involving running executable on the target machine.
+++++++++++++++++++++++++++++++++++++++++++++++++

  DeprecationWarning)
customize GnuFCompiler
Could not locate executable g77
Could not locate executable f77
customize IntelFCompiler
Could not locate executable ifort
Could not locate executable ifc
customize LaheyFCompiler
Could not locate executable lf95
customize PGroupFCompiler
Could not locate executable pgf90
Could not locate executable pgf77
customize AbsoftFCompiler
Could not locate executable f90
customize NAGFCompiler
Found executable /usr/bin/f95
customize VastFCompiler
customize CompaqFCompiler
Could not locate executable fort
customize IntelItaniumFCompiler
Could not locate executable efort
Could not locate executable efc
customize IntelEM64TFCompiler
customize Gnu95FCompiler
Found executable /usr/bin/gfortran
customize Gnu95FCompiler
customize Gnu95FCompiler using config
compiling '_configtest.c':

/* This file is generated from numpy/distutils/system_info.py */
void ATL_buildinfo(void);
int main(void) {
  ATL_buildinfo();
  return 0;
}
C compiler: gcc -pthread -fno-strict-aliasing -DNDEBUG -g -fwrapv -O2
-Wall -Wstrict-prototypes -fPIC

compile options: '-c'
gcc: _configtest.c
gcc -pthread _configtest.o -L/usr/lib/sse -lf77blas -lcblas -latlas -o
_configtest
ATLAS version 3.6.0 built by root on Fri Jan  9 15:57:20 UTC 2004:
   UNAME    : Linux intech67 2.4.20 #1 SMP Fri Jan 10 18:29:51 EST
2003 i686 GNU/Linux
   INSTFLG  :
   MMDEF    : /fix/g/camm/atlas3-3.6.0/CONFIG/ARCHS/P4SSE2/gcc/gemm
   ARCHDEF  : /fix/g/camm/atlas3-3.6.0/CONFIG/ARCHS/P4SSE2/gcc/misc
   F2CDEFS  : -DAdd__ -DStringSunStyle
   CACHEEDGE: 1048576
   F77      : /usr/bin/g77, version GNU Fortran (GCC) 3.3.3 20031229
(prerelease) (Debian)
   F77FLAGS : -fomit-frame-pointer -O
   CC       : /usr/bin/gcc, version gcc (GCC) 3.3.3 20031229
(prerelease) (Debian)
   CC FLAGS : -fomit-frame-pointer -O3 -funroll-all-loops
   MCC      : /usr/bin/gcc, version gcc (GCC) 3.3.3 20031229
(prerelease) (Debian)
   MCCFLAGS : -fomit-frame-pointer -O
success!
removing: _configtest.c _configtest.o _configtest
  FOUND:
    libraries = ['f77blas', 'cblas', 'atlas']
    library_dirs = ['/usr/lib/sse']
    language = c
    define_macros = [('ATLAS_INFO', '"\\"3.6.0\\""')]
    include_dirs = ['/usr/include']

  FOUND:
    libraries = ['f77blas', 'cblas', 'atlas']
    library_dirs = ['/usr/lib/sse']
    language = c
    define_macros = [('ATLAS_INFO', '"\\"3.6.0\\""')]
    include_dirs = ['/usr/include']

lapack_opt_info:
lapack_mkl_info:
mkl_info:
  libraries mkl,vml,guide not found in /usr/lib
  NOT AVAILABLE

  NOT AVAILABLE

atlas_threads_info:
Setting PTATLAS=ATLAS
  libraries ptf77blas,ptcblas,atlas not found in /usr/lib/atlas
  libraries lapack_atlas not found in /usr/lib/atlas
  libraries ptf77blas,ptcblas,atlas not found in /usr/lib/sse
  libraries ptf77blas,ptcblas,atlas not found in /usr/lib/sse2
  libraries ptf77blas,ptcblas,atlas not found in /usr/lib
numpy.distutils.system_info.atlas_threads_info
  NOT AVAILABLE

atlas_info:
  libraries f77blas,cblas,atlas not found in /usr/lib/atlas
  libraries lapack_atlas not found in /usr/lib/atlas
  libraries lapack not found in /usr/lib/sse
numpy.distutils.system_info.atlas_info
  FOUND:
    libraries = ['lapack', 'f77blas', 'cblas', 'atlas']
    library_dirs = ['/usr/lib/sse/atlas', '/usr/lib/sse']
    language = f77
    define_macros = [('ATLAS_INFO', '"\\"3.6.0\\""')]
    include_dirs = ['/usr/include']

  FOUND:
    libraries = ['lapack', 'f77blas', 'cblas', 'atlas']
    library_dirs = ['/usr/lib/sse/atlas', '/usr/lib/sse']
    language = f77
    define_macros = [('ATLAS_INFO', '"\\"3.6.0\\""')]
    include_dirs = ['/usr/include']

running install
running build
running config_cc
unifing config_cc, config, build_clib, build_ext, build commands
--compiler options
running config_fc
unifing config_fc, config, build_clib, build_ext, build commands
--fcompiler options
running build_src
build_src
building py_modules sources
building library "npymath" sources
customize GnuFCompiler
customize IntelFCompiler
customize LaheyFCompiler
customize PGroupFCompiler
customize AbsoftFCompiler
customize NAGFCompiler
customize VastFCompiler
customize CompaqFCompiler
customize IntelItaniumFCompiler
customize IntelEM64TFCompiler
customize Gnu95FCompiler
customize Gnu95FCompiler
customize Gnu95FCompiler using config
C compiler: gcc -pthread -fno-strict-aliasing -DNDEBUG -g -fwrapv -O2
-Wall -Wstrict-prototypes -fPIC

compile options: '-Inumpy/core/src/private -Inumpy/core/src
-Inumpy/core -Inumpy/core/src/npymath -Inumpy/core/src/multiarray
-Inumpy/core/src/umath -Inumpy/core/include -I/usr/include/python2.6
-c'
gcc: _configtest.c
gcc -pthread _configtest.o -o _configtest
success!
removing: _configtest.c _configtest.o _configtest
C compiler: gcc -pthread -fno-strict-aliasing -DNDEBUG -g -fwrapv -O2
-Wall -Wstrict-prototypes -fPIC

compile options: '-Inumpy/core/src/private -Inumpy/core/src
-Inumpy/core -Inumpy/core/src/npymath -Inumpy/core/src/multiarray
-Inumpy/core/src/umath -Inumpy/core/include -I/usr/include/python2.6
-c'
gcc: _configtest.c
_configtest.c:1: warning: conflicting types for built-in function ‘exp’
gcc -pthread _configtest.o -o _configtest
_configtest.o: In function `main':
/home/ryan/Downloads/numpy-1.6.1/_configtest.c:6: undefined reference to `exp'
collect2: ld returned 1 exit status
_configtest.o: In function `main':
/home/ryan/Downloads/numpy-1.6.1/_configtest.c:6: undefined reference to `exp'
collect2: ld returned 1 exit status
failure.
removing: _configtest.c _configtest.o
C compiler: gcc -pthread -fno-strict-aliasing -DNDEBUG -g -fwrapv -O2
-Wall -Wstrict-prototypes -fPIC

compile options: '-Inumpy/core/src/private -Inumpy/core/src
-Inumpy/core -Inumpy/core/src/npymath -Inumpy/core/src/multiarray
-Inumpy/core/src/umath -Inumpy/core/include -I/usr/include/python2.6
-c'
gcc: _configtest.c
_configtest.c:1: warning: conflicting types for built-in function ‘exp’
gcc -pthread _configtest.o -lm -o _configtest
success!
removing: _configtest.c _configtest.o _configtest
building extension "numpy.core._sort" sources
  adding 'build/src.linux-i686-2.6/numpy/core/include/numpy/config.h'
to sources.
  adding 'build/src.linux-i686-2.6/numpy/core/include/numpy/_numpyconfig.h'
to sources.
executing numpy/core/code_generators/generate_numpy_api.py
  adding 'build/src.linux-i686-2.6/numpy/core/include/numpy/__multiarray_api.h'
to sources.
numpy.core - nothing done with h_files =
['build/src.linux-i686-2.6/numpy/core/include/numpy/config.h',
'build/src.linux-i686-2.6/numpy/core/include/numpy/_numpyconfig.h',
'build/src.linux-i686-2.6/numpy/core/include/numpy/__multiarray_api.h']
building extension "numpy.core.multiarray" sources
  adding 'build/src.linux-i686-2.6/numpy/core/include/numpy/config.h'
to sources.
  adding 'build/src.linux-i686-2.6/numpy/core/include/numpy/_numpyconfig.h'
to sources.
executing numpy/core/code_generators/generate_numpy_api.py
  adding 'build/src.linux-i686-2.6/numpy/core/include/numpy/__multiarray_api.h'
to sources.
numpy.core - nothing done with h_files =
['build/src.linux-i686-2.6/numpy/core/include/numpy/config.h',
'build/src.linux-i686-2.6/numpy/core/include/numpy/_numpyconfig.h',
'build/src.linux-i686-2.6/numpy/core/include/numpy/__multiarray_api.h']
building extension "numpy.core.umath" sources
  adding 'build/src.linux-i686-2.6/numpy/core/include/numpy/config.h'
to sources.
  adding 'build/src.linux-i686-2.6/numpy/core/include/numpy/_numpyconfig.h'
to sources.
executing numpy/core/code_generators/generate_ufunc_api.py
  adding 'build/src.linux-i686-2.6/numpy/core/include/numpy/__ufunc_api.h'
to sources.
  adding 'build/src.linux-i686-2.6/numpy/core/src/umath' to include_dirs.
numpy.core - nothing done with h_files =
['build/src.linux-i686-2.6/numpy/core/src/umath/funcs.inc',
'build/src.linux-i686-2.6/numpy/core/include/numpy/config.h',
'build/src.linux-i686-2.6/numpy/core/include/numpy/_numpyconfig.h',
'build/src.linux-i686-2.6/numpy/core/include/numpy/__ufunc_api.h']
building extension "numpy.core.scalarmath" sources
  adding 'build/src.linux-i686-2.6/numpy/core/include/numpy/config.h'
to sources.
  adding 'build/src.linux-i686-2.6/numpy/core/include/numpy/_numpyconfig.h'
to sources.
executing numpy/core/code_generators/generate_numpy_api.py
  adding 'build/src.linux-i686-2.6/numpy/core/include/numpy/__multiarray_api.h'
to sources.
executing numpy/core/code_generators/generate_ufunc_api.py
  adding 'build/src.linux-i686-2.6/numpy/core/include/numpy/__ufunc_api.h'
to sources.
numpy.core - nothing done with h_files =
['build/src.linux-i686-2.6/numpy/core/include/numpy/config.h',
'build/src.linux-i686-2.6/numpy/core/include/numpy/_numpyconfig.h',
'build/src.linux-i686-2.6/numpy/core/include/numpy/__multiarray_api.h',
'build/src.linux-i686-2.6/numpy/core/include/numpy/__ufunc_api.h']
building extension "numpy.core._dotblas" sources
  adding 'numpy/core/blasdot/_dotblas.c' to sources.
building extension "numpy.core.umath_tests" sources
building extension "numpy.core.multiarray_tests" sources
building extension "numpy.lib._compiled_base" sources
building extension "numpy.numarray._capi" sources
building extension "numpy.fft.fftpack_lite" sources
building extension "numpy.linalg.lapack_lite" sources
  adding 'numpy/linalg/lapack_litemodule.c' to sources.
  adding 'numpy/linalg/python_xerbla.c' to sources.
building extension "numpy.random.mtrand" sources
/home/ryan/Downloads/numpy-1.6.1/numpy/distutils/command/config.py:40:
DeprecationWarning:
+++++++++++++++++++++++++++++++++++++++++++++++++
Usage of try_run is deprecated: please do not
use it anymore, and avoid configuration checks
involving running executable on the target machine.
+++++++++++++++++++++++++++++++++++++++++++++++++

  DeprecationWarning)
C compiler: gcc -pthread -fno-strict-aliasing -DNDEBUG -g -fwrapv -O2
-Wall -Wstrict-prototypes -fPIC

compile options: '-Inumpy/core/src/private -Inumpy/core/src
-Inumpy/core -Inumpy/core/src/npymath -Inumpy/core/src/multiarray
-Inumpy/core/src/umath -Inumpy/core/include -I/usr/include/python2.6
-c'
gcc: _configtest.c
gcc -pthread _configtest.o -o _configtest
_configtest
failure.
removing: _configtest.c _configtest.o _configtest
building data_files sources
build_src: building npy-pkg config files
running build_py
copying numpy/version.py -> build/lib.linux-i686-2.6/numpy
copying build/src.linux-i686-2.6/numpy/__config__.py ->
build/lib.linux-i686-2.6/numpy
copying build/src.linux-i686-2.6/numpy/distutils/__config__.py ->
build/lib.linux-i686-2.6/numpy/distutils
running build_clib
customize UnixCCompiler
customize UnixCCompiler using build_clib
running build_ext
customize UnixCCompiler
customize UnixCCompiler using build_ext
customize GnuFCompiler
customize IntelFCompiler
customize LaheyFCompiler
customize PGroupFCompiler
customize AbsoftFCompiler
customize NAGFCompiler
customize VastFCompiler
customize CompaqFCompiler
customize IntelItaniumFCompiler
customize IntelEM64TFCompiler
customize Gnu95FCompiler
customize Gnu95FCompiler
customize Gnu95FCompiler using build_ext
running scons
running build_scripts
  adding 'build/scripts.linux-i686-2.6/f2py' to scripts
running install_lib
copying build/lib.linux-i686-2.6/numpy/numarray/_capi.so ->
/usr/local/lib/python2.6/dist-packages/numpy/numarray
copying build/lib.linux-i686-2.6/numpy/version.py ->
/usr/local/lib/python2.6/dist-packages/numpy
copying build/lib.linux-i686-2.6/numpy/distutils/__config__.py ->
/usr/local/lib/python2.6/dist-packages/numpy/distutils
copying build/lib.linux-i686-2.6/numpy/__config__.py ->
/usr/local/lib/python2.6/dist-packages/numpy
copying build/lib.linux-i686-2.6/numpy/random/mtrand.so ->
/usr/local/lib/python2.6/dist-packages/numpy/random
copying build/lib.linux-i686-2.6/numpy/linalg/lapack_lite.so ->
/usr/local/lib/python2.6/dist-packages/numpy/linalg
copying build/lib.linux-i686-2.6/numpy/core/_dotblas.so ->
/usr/local/lib/python2.6/dist-packages/numpy/core
copying build/lib.linux-i686-2.6/numpy/core/umath.so ->
/usr/local/lib/python2.6/dist-packages/numpy/core
copying build/lib.linux-i686-2.6/numpy/core/_sort.so ->
/usr/local/lib/python2.6/dist-packages/numpy/core
copying build/lib.linux-i686-2.6/numpy/core/umath_tests.so ->
/usr/local/lib/python2.6/dist-packages/numpy/core
copying build/lib.linux-i686-2.6/numpy/core/multiarray.so ->
/usr/local/lib/python2.6/dist-packages/numpy/core
copying build/lib.linux-i686-2.6/numpy/core/multiarray_tests.so ->
/usr/local/lib/python2.6/dist-packages/numpy/core
copying build/lib.linux-i686-2.6/numpy/core/scalarmath.so ->
/usr/local/lib/python2.6/dist-packages/numpy/core
copying build/lib.linux-i686-2.6/numpy/lib/_compiled_base.so ->
/usr/local/lib/python2.6/dist-packages/numpy/lib
copying build/lib.linux-i686-2.6/numpy/fft/fftpack_lite.so ->
/usr/local/lib/python2.6/dist-packages/numpy/fft
byte-compiling /usr/local/lib/python2.6/dist-packages/numpy/version.py
to version.pyc
byte-compiling /usr/local/lib/python2.6/dist-packages/numpy/distutils/__config__.py
to __config__.pyc
byte-compiling /usr/local/lib/python2.6/dist-packages/numpy/__config__.py
to __config__.pyc
running install_scripts
copying build/scripts.linux-i686-2.6/f2py -> /usr/local/bin
changing mode of /usr/local/bin/f2py to 755
running install_data
copying build/src.linux-i686-2.6/numpy/core/include/numpy/_numpyconfig.h
-> /usr/local/lib/python2.6/dist-packages/numpy/core/include/numpy
copying build/src.linux-i686-2.6/numpy/core/include/numpy/__multiarray_api.h
-> /usr/local/lib/python2.6/dist-packages/numpy/core/include/numpy
copying build/src.linux-i686-2.6/numpy/core/include/numpy/multiarray_api.txt
-> /usr/local/lib/python2.6/dist-packages/numpy/core/include/numpy
copying build/src.linux-i686-2.6/numpy/core/include/numpy/__ufunc_api.h
-> /usr/local/lib/python2.6/dist-packages/numpy/core/include/numpy
copying build/src.linux-i686-2.6/numpy/core/include/numpy/ufunc_api.txt
-> /usr/local/lib/python2.6/dist-packages/numpy/core/include/numpy
copying build/src.linux-i686-2.6/numpy/core/lib/npy-pkg-config/npymath.ini
-> /usr/local/lib/python2.6/dist-packages/numpy/core/lib/npy-pkg-config
copying build/src.linux-i686-2.6/numpy/core/lib/npy-pkg-config/mlib.ini
-> /usr/local/lib/python2.6/dist-packages/numpy/core/lib/npy-pkg-config
running install_egg_info
Removing /usr/local/lib/python2.6/dist-packages/numpy-1.6.1.egg-info
Writing /usr/local/lib/python2.6/dist-packages/numpy-1.6.1.egg-info
running install_clib
copying build/temp.linux-i686-2.6/libnpymath.a ->
/usr/local/lib/python2.6/dist-packages/numpy/core/lib


Thanks,

Ryan


More information about the SciPy-User mailing list