<div class="gmail_quote">On Mon, Dec 13, 2010 at 10:12 AM, Ralf Gommers <span dir="ltr">&lt;<a href="mailto:ralf.gommers@googlemail.com">ralf.gommers@googlemail.com</a>&gt;</span> wrote:<br><blockquote class="gmail_quote" style="margin: 0pt 0pt 0pt 0.8ex; border-left: 1px solid rgb(204, 204, 204); padding-left: 1ex;">

Hi,<br><br>I am pleased to announce the availability of <span>the first <span>beta</span> of SciPy 0.9.0</span>. This will be the first SciPy release to include support for Python 3, as well as for Python 2.7. Please try this <span>beta</span> and report any problems on the scipy-dev mailing list.<br>





<br>Binaries, sources and release notes can be found 
at<a href="https://sourceforge.net/projects/numpy/files/" target="_blank"> http://sourceforge.net/projects/scipy/files/scipy/0.9.0b1/</a>. Note that not all binaries (win32-py27, *-macosx10.3) are uploaded yet, they will follow in the next day or two.<br>


<br>There are still a few known issues (so no need to report these):<br>1. Arpack related errors on 64-bit OS X.<br>

2. Correlate complex192 errors on Windows.<br>3. correlate/conjugate current behavior is deprecated and should be removed before RC1.<br><br>Enjoy,<br><font color="#888888">Ralf<br>
</font><br></blockquote><div><br>Just did a clean rebuild (after a clean rebuild of numpy) and had two errors in the tests:<br><br>======================================================================<br>FAIL: test_imresize (test_pilutil.TestPILUtil)<br>

----------------------------------------------------------------------<br>Traceback (most recent call last):<br>  File &quot;/home/bvr/Programs/numpy/numpy/testing/decorators.py&quot;, line 146, in skipper_func<br>    return f(*args, **kwargs)<br>

  File &quot;/home/bvr/Programs/scipy/scipy/misc/tests/test_pilutil.py&quot;, line 25, in test_imresize<br>    assert_equal(im1.shape,(11,22))<br>  File &quot;/home/bvr/Programs/numpy/numpy/testing/utils.py&quot;, line 251, in assert_equal<br>

    assert_equal(actual[k], desired[k], &#39;item=%r\n%s&#39; % (k,err_msg), verbose)<br>  File &quot;/home/bvr/Programs/numpy/numpy/testing/utils.py&quot;, line 313, in assert_equal<br>    raise AssertionError(msg)<br>AssertionError: <br>

Items are not equal:<br>item=0<br><br> ACTUAL: 10<br> DESIRED: 11<br><br>======================================================================<br>FAIL: test_basic (test_signaltools.TestMedFilt)<br>----------------------------------------------------------------------<br>

Traceback (most recent call last):<br>  File &quot;/home/bvr/Programs/scipy/scipy/signal/tests/test_signaltools.py&quot;, line 284, in test_basic<br>    [ 0,  7, 11,  7,  4,  4, 19, 19, 24,  0]])<br>  File &quot;/home/bvr/Programs/numpy/numpy/testing/utils.py&quot;, line 686, in assert_array_equal<br>

    verbose=verbose, header=&#39;Arrays are not equal&#39;)<br>  File &quot;/home/bvr/Programs/numpy/numpy/testing/utils.py&quot;, line 618, in assert_array_compare<br>    raise AssertionError(msg)<br>AssertionError: <br>

Arrays are not equal<br><br>(mismatch 8.0%)<br> x: array([[  0.,  50.,  50.,  50.,  42.,  15.,  15.,  18.,  27.,   0.],<br>       [  0.,  50.,  50.,  50.,  50.,  42.,  19.,  21.,  29.,   0.],<br>       [ 50.,  50.,  50.,  50.,  50.,  47.,  34.,  34.,  46.,  35.],...<br>

 y: array([[ 0, 50, 50, 50, 42, 15, 15, 18, 27,  0],<br>       [ 0, 50, 50, 50, 50, 42, 19, 21, 29,  0],<br>       [50, 50, 50, 50, 50, 47, 34, 34, 46, 35],...<br><br>----------------------------------------------------------------------<br>

Ran 4822 tests in 199.244s<br><br>FAILED (KNOWNFAIL=12, SKIP=35, failures=2)<br>&lt;nose.result.TextTestResult run=4822 errors=0 failures=2&gt;<br><br><br>Don&#39;t know about the first one, but the second one looks like a type-casting issue, because all the values are the same, except one is floating point and the other is integer.<br>

<br>Ben Root<br><br></div></div>