<html>
  <head>
    <meta content="text/html; charset=ISO-8859-1"
      http-equiv="Content-Type">
  </head>
  <body bgcolor="#FFFFFF" text="#000000">
    I commented out the entire function 'def test_qz_double_sort(self):'
    in 'test_decomp.py.&nbsp; It ran to the end with one error, one failure.<br>
    john<br>
    <br>
======================================================================<br>
    ERROR: Failure: AttributeError ('module' object has no attribute
    'FileType')<br>
----------------------------------------------------------------------<br>
    Traceback (most recent call last):<br>
    &nbsp; File
    "C:\Python32\lib\site-packages\nose-1.0.0-py3.2.egg\nose\failure.py",
    line 37, in runTest<br>
    &nbsp;&nbsp;&nbsp; raise self.exc_class(self.exc_val).with_traceback(self.tb)<br>
    &nbsp; File
    "C:\Python32\lib\site-packages\nose-1.0.0-py3.2.egg\nose\loader.py",
    line 390, in loadTestsFromName<br>
    &nbsp;&nbsp;&nbsp; addr.filename, addr.module)<br>
    &nbsp; File
    "C:\Python32\lib\site-packages\nose-1.0.0-py3.2.egg\nose\importer.py",
    line 39, in importFromPath<br>
    &nbsp;&nbsp;&nbsp; return self.importFromDir(dir_path, fqname)<br>
    &nbsp; File
    "C:\Python32\lib\site-packages\nose-1.0.0-py3.2.egg\nose\importer.py",
    line 86, in importFromDir<br>
    &nbsp;&nbsp;&nbsp; mod = load_module(part_fqname, fh, filename, desc)<br>
    &nbsp; File "C:\Python32\lib\site-packages\scipy\weave\__init__.py", line
    22, in &lt;module&gt;<br>
    &nbsp;&nbsp;&nbsp; from .blitz_tools import blitz<br>
    &nbsp; File "C:\Python32\lib\site-packages\scipy\weave\blitz_tools.py",
    line 6, in &lt;module&gt;<br>
    &nbsp;&nbsp;&nbsp; from . import converters<br>
    &nbsp; File "C:\Python32\lib\site-packages\scipy\weave\converters.py",
    line 19, in &lt;module&gt;<br>
    &nbsp;&nbsp;&nbsp; c_spec.file_converter(),<br>
    &nbsp; File "C:\Python32\lib\site-packages\scipy\weave\c_spec.py", line
    74, in __init__<br>
    &nbsp;&nbsp;&nbsp; self.init_info()<br>
    &nbsp; File "C:\Python32\lib\site-packages\scipy\weave\c_spec.py", line
    264, in init_info<br>
    &nbsp;&nbsp;&nbsp; self.matching_types = [types.FileType]<br>
    AttributeError: 'module' object has no attribute 'FileType'<br>
    <br>
======================================================================<br>
    FAIL: test_definition (test_real_transforms.TestDSTIDouble)<br>
----------------------------------------------------------------------<br>
    Traceback (most recent call last):<br>
    &nbsp; File
    "C:\Python32\lib\site-packages\scipy\fftpack\tests\test_real_transforms.py",
    line 213, in test_definition<br>
    &nbsp;&nbsp;&nbsp; err_msg="Size %d failed" % i)<br>
    &nbsp; File "C:\Python32\lib\site-packages\numpy\testing\utils.py", line
    800, in assert_array_almost_equal<br>
    &nbsp;&nbsp;&nbsp; header=('Arrays are not almost equal to %d decimals' % decimal))<br>
    &nbsp; File "C:\Python32\lib\site-packages\numpy\testing\utils.py", line
    636, in assert_array_compare<br>
    &nbsp;&nbsp;&nbsp; raise AssertionError(msg)<br>
    AssertionError: <br>
    Arrays are not almost equal to 15 decimals<br>
    Size 256 failed<br>
    (mismatch 3.515625%)<br>
    &nbsp;x: array([&nbsp; 1.00000000e+00,&nbsp; -5.03902743e-01,&nbsp;&nbsp; 3.33300126e-01,<br>
    &nbsp;&nbsp;&nbsp;&nbsp;&nbsp;&nbsp;&nbsp; -2.51913719e-01,&nbsp;&nbsp; 1.99940224e-01,&nbsp; -1.67900640e-01,<br>
    &nbsp;&nbsp;&nbsp;&nbsp;&nbsp;&nbsp;&nbsp;&nbsp; 1.42771743e-01,&nbsp; -1.25881543e-01,&nbsp;&nbsp; 1.11000399e-01,...<br>
    &nbsp;y: array([&nbsp; 1.00000000e+00,&nbsp; -5.03902743e-01,&nbsp;&nbsp; 3.33300126e-01,<br>
    &nbsp;&nbsp;&nbsp;&nbsp;&nbsp;&nbsp;&nbsp; -2.51913719e-01,&nbsp;&nbsp; 1.99940224e-01,&nbsp; -1.67900640e-01,<br>
    &nbsp;&nbsp;&nbsp;&nbsp;&nbsp;&nbsp;&nbsp;&nbsp; 1.42771743e-01,&nbsp; -1.25881543e-01,&nbsp;&nbsp; 1.11000399e-01,...<br>
    <br>
----------------------------------------------------------------------<br>
    Ran 5350 tests in 107.390s<br>
    <br>
    FAILED (KNOWNFAIL=13, SKIP=42, errors=1, failures=1)<br>
    <br>
    <br>
    <br>
    <br>
    <br>
    <br>
    <div class="moz-cite-prefix">On 7/20/2012 3:39 PM, Ralf Gommers
      wrote:<br>
    </div>
    <blockquote
cite="mid:CABL7CQhZTjKY1g6=MEnxUo7TF1A9HDRDNs+1=JpNZPJoV3QLbQ@mail.gmail.com"
      type="cite"><br>
      <br>
      <div class="gmail_quote">On Fri, Jul 20, 2012 at 3:47 PM, John
        Hassler <span dir="ltr">&lt;<a moz-do-not-send="true"
            href="mailto:hasslerjc@comcast.net" target="_blank">hasslerjc@comcast.net</a>&gt;</span>
        wrote:<br>
        <blockquote class="gmail_quote" style="margin:0 0 0
          .8ex;border-left:1px #ccc solid;padding-left:1ex">
          Crashes with "unhandled exception in python.exe" in Python
          3.2. &nbsp;The<br>
          computer is:<br>
          Intel Core2 Quad Q6600 with 3 GB memory<br>
          Windows XP Service Pack 3.<br>
          I removed and re-installed Scipy, but there was no change in
          the result.<br>
          <br>
          Are there other things I could check that might be helpful?<br>
        </blockquote>
        <div><br>
          Could you comment out the crashing test and check that the
          rest of the tests run fine (or report other failures)? The QZ
          decomposition code was recently added; looks like it needs
          some fixing.<br>
          <br>
          Thanks,<br>
          Ralf<br>
          <br>
          &nbsp;<br>
        </div>
        <blockquote class="gmail_quote" style="margin:0 0 0
          .8ex;border-left:1px #ccc solid;padding-left:1ex">
          john<br>
          <br>
          &nbsp;&gt;&gt;&gt; import scipy<br>
          &nbsp;&gt;&gt;&gt; scipy.test(verbose=10)<br>
          <div class="im">Running unit tests for scipy<br>
          </div>
          NumPy version 1.6.2<br>
          NumPy is installed in C:\Python32\lib\site-packages\numpy<br>
          SciPy version 0.11.0rc1<br>
          SciPy is installed in C:\Python32\lib\site-packages\scipy<br>
          Python version 3.2.3 (default, Apr 11 2012, 07:15:24) [MSC
          v.1500 32 bit<br>
          (Intel)]<br>
          nose version 1.0.0<br>
          nose.config: INFO: Excluding tests matching ['f2py_ext',
          'f2py_f90_ext',<br>
          'gen_ext', 'pyrex_ext', 'swig_ext']<br>
          Tests cophenet(Z) on tdist data set. ... ok<br>
          Tests cophenet(Z, Y) on tdist data set. ... ok<br>
          <br>
          .........<br>
          <br>
          test_qz_complex64 (test_decomp.TestQZ) ... ok<br>
          test_qz_complex_sort (test_decomp.TestQZ) ... ok<br>
          test_qz_double (test_decomp.TestQZ) ... ok<br>
          test_qz_double_complex (test_decomp.TestQZ) ... ok<br>
          test_qz_double_sort (test_decomp.TestQZ) ...<br>
          &nbsp;&gt;&gt;&gt; ================================ RESTART<br>
          ================================<br>
          <div class="HOEnZb">
            <div class="h5">&nbsp;&gt;&gt;&gt;<br>
              <br>
              _______________________________________________<br>
              SciPy-User mailing list<br>
              <a moz-do-not-send="true"
                href="mailto:SciPy-User@scipy.org">SciPy-User@scipy.org</a><br>
              <a moz-do-not-send="true"
                href="http://mail.scipy.org/mailman/listinfo/scipy-user"
                target="_blank">http://mail.scipy.org/mailman/listinfo/scipy-user</a><br>
            </div>
          </div>
        </blockquote>
      </div>
      <br>
      <br>
      <fieldset class="mimeAttachmentHeader"></fieldset>
      <br>
      <pre wrap="">_______________________________________________
SciPy-User mailing list
<a class="moz-txt-link-abbreviated" href="mailto:SciPy-User@scipy.org">SciPy-User@scipy.org</a>
<a class="moz-txt-link-freetext" href="http://mail.scipy.org/mailman/listinfo/scipy-user">http://mail.scipy.org/mailman/listinfo/scipy-user</a>
</pre>
      <br>
      <fieldset class="mimeAttachmentHeader"></fieldset>
      <br>
      <p class="" avgcert""="" color="#000000" align="left">No virus
        found in this message.<br>
        Checked by AVG - <a moz-do-not-send="true"
          href="http://www.avg.com">www.avg.com</a><br>
        Version: 2012.0.2197 / Virus Database: 2437/5143 - Release Date:
        07/20/12</p>
    </blockquote>
    <br>
  </body>
</html>